program: Gaussian 09
title: 000222143
version: EM64L-G09RevD.01
frameworkgroup: C1[X(C16H14O5)]
method: RPBEPBE
basis: SDD
operation: Freq
keyword: #pfreq=noraman
keyword: PBEPBE/SDD
title: #p freq=noraman PBEPBE/SDD
converged: YES YES NO NO
title: Mulliken charges:
elementType: O O O O O C C C C C C C C C C C C C C C C H H H H H H H H H H H H H H
charge: -0.337760 -0.274377 -0.253868 -0.212883 -0.207149 0.298727 0.191798 0.233232 0.433943 -0.481029 -0.292179 -0.398862 -0.340430 -0.306163 0.127396 0.337281 -0.349058 -0.347945 -0.209748 -0.513742 -0.536571 0.295328 0.268024 0.238118 0.268991 0.274467 0.249608 0.259991 0.167045 0.247925 0.222809 0.238215 0.228436 0.227818 0.252612
chargesum: 0.00000
title: Mulliken charges with hydrogens summed into heavy atoms:
elementType: O O O O O C C C C C C C C C C C C C C C C
charge: -0.337760 -0.274377 -0.253868 -0.212883 -0.207149 0.298727 0.191798 0.233232 0.433943 -0.185702 -0.024155 -0.160744 -0.071440 -0.031696 0.127396 0.337281 -0.099450 -0.087954 -0.042703 0.195207 0.172296
polarizability: 3.71435405e+02 1.06325032e+01 1.71405284e+02 4.54974432e+00 -9.39912449e+00 1.08755155e+02
1716.lowfreq: -3.7867 -1.9945 -0.0008 -0.0005 0.0004 6.6467 19.8183 21.9196 36.0669
frequency: 19.7043 21.9020 35.9982 65.2702 68.9970 84.1241 92.1954 134.4739 141.5079 148.4492 166.6798 172.9435 207.9898 213.7853 217.2782 254.2375 293.0669 301.5936 320.5738 370.9610 379.2915 418.2930 434.8661 453.3064 468.9380 499.4084 507.0728 544.2197 578.6841 600.8489 625.8615 637.9954 667.1039 707.9150 713.1037 750.3261 758.7537 765.2295 806.2211 822.1909 827.3387 852.5653 896.5731 912.2010 948.0966 976.9422 977.4736 981.9680 988.5643 993.4114 1004.3469 1011.8677 1094.6031 1105.7555 1110.5511 1116.1302 1149.2164 1156.6090 1160.7086 1169.2290 1184.0548 1236.1585 1244.5919 1254.1688 1259.6951 1301.2430 1369.0321 1378.6765 1394.2258 1408.6276 1433.2460 1436.7336 1445.4582 1458.3029 1468.8106 1470.3247 1470.8988 1481.0156 1497.5651 1571.1228 1572.8193 1597.2582 1619.1781 1622.8274 1644.8778 2868.4887 2970.7971 2985.1689 3063.6641 3092.5845 3122.9513 3135.0567 3136.6013 3150.8351 3163.0407 3166.0531 3172.5194 3183.6505 3184.6291
redmass: 5.9888 5.1710 4.8480 2.7197 5.1846 5.2256 5.6815 3.0470 2.3216 5.8707 3.5408 4.1807 2.7248 1.9337 1.6828 3.9880 3.6322 4.5628 7.0029 8.1596 4.3651 2.9996 5.6331 4.8849 3.6929 4.4359 3.1750 6.1425 7.3110 4.4409 7.0665 6.6753 4.4369 5.5377 4.9877 4.5373 5.0776 5.4543 2.8103 2.0633 1.2805 1.6523 6.2772 1.4139 1.3741 3.4872 1.7173 8.3313 1.3488 1.8399 3.0736 2.6649 2.5838 1.3088 1.2599 1.3189 1.3924 1.3214 1.9609 1.4385 1.5530 2.8847 3.3943 2.9178 1.8398 1.2886 1.9283 5.0904 5.5491 1.7437 3.5020 1.2649 1.4864 1.0593 1.0573 1.0688 1.0776 2.6897 2.5245 7.6720 8.1555 6.5885 6.3830 7.0314 11.8275 1.0847 1.0325 1.0316 1.1045 1.1016 1.1044 1.1002 1.0901 1.0886 1.0885 1.0919 1.0957 1.0974 1.0950
irintensity: 1.2575 0.3404 0.7649 5.3484 4.5672 1.6744 4.0748 4.2663 1.7172 9.0988 4.1431 4.0323 4.5626 0.2526 1.6753 3.8526 8.0347 0.1158 3.3993 2.4818 3.4379 0.0979 13.7065 3.5630 5.6124 1.6268 10.5848 11.3445 13.9937 9.5280 4.6744 42.4049 27.3000 33.0529 18.5187 3.9265 15.2958 18.7105 19.2432 28.4801 5.9221 61.7140 59.1797 20.2572 2.9690 353.2770 110.8430 98.1053 0.4623 11.8943 16.1777 194.0083 252.8551 38.7948 0.2127 11.6415 40.3364 10.9237 120.5870 326.2585 6.3623 124.2625 679.8470 69.8676 68.6968 2.1328 53.2743 23.7918 11.0455 83.5657 1.2471 13.1719 41.3629 14.6131 25.6240 44.6556 33.0352 79.9407 72.2478 11.7889 53.4730 261.5492 308.1032 94.5695 165.3291 141.2522 69.7327 54.4243 39.8919 31.8098 24.9574 21.1180 7.6845 0.9157 2.6805 2.9918 12.4408 2.3856 3.2407
temp: 298.150 k
press: 1.00000 atm
elementType: 8 8 8 8 8 6 6 6 6 6 6 6 6 6 6 6 6 6 6 6 6 1 1 1 1 1 1 1 1 1 1 1 1 1 1
symmnumber: 1
zpe: 688585.3 jmol-1
zpe.correction: 0.262268 hartree
zpe.thermalcorrener: 0.282099 hartree
zpe.thermalcorrenthalpy: 0.283043 hartree
zpe.thermalcorrgfe: 0.211581 hartree
zpe.sumelectzpe: -992.683818 hartree
zpe.sumelectthermal: -992.663987 hartree
zpe.sumelectthermalent: -992.663043 hartree
zpe.sumelectthermalfe: -992.734505 hartree
dipole: 8.8903 -1.4799 0.5303
dipole: 9.0282
quadrupole: -121.7796 -117.5333 -122.3218
quadrupole: 6.5851 4.8033 5.6238
quadrupole: -1.2347 3.0116 -1.7769 6.5851 4.8033 5.6238
hfenergy: -992.9460862 hartree
pointgroup: C01 [X(C16H14O5)]
dipole: 3.4894372 -0.6098888 0.2613809 debye
polarizability: 371.4467982|9.0867483|170.9987083|7.7681575|-10.0746754|109.1503375 unknown
InChI: InChI=1S/C16H14O5/c1-19-13-6-4-12(5-7-13)16(18)21-14-8-3-11(10-17)9-15(14)20-2/h3-10H,1-2H3
charge 0 multiplicity 1
35 atoms
O  -0.383929 0.102475 -0.291112
O  -2.172753 2.332326 0.148228
O  5.935526 0.603638 -0.784206
O  0.151047 -1.72235 1.101447
O  -6.889597 0.371973 -0.535918
C  -1.785611 -0.116815 -0.258453
C  -2.622006 1.029796 -0.086999
C  1.926955 -0.411045 0.05912
C  -4.579095 -0.398153 -0.495704
C  -4.016228 0.872289 -0.224243
C  -2.342343 -1.390708 -0.512386
C  -3.735976 -1.533645 -0.628418
C  2.966434 -1.130478 0.704186
C  2.263971 0.629177 -0.854544
C  0.53018 -0.785898 0.365808
C  4.639068 0.213282 -0.456143
C  4.317281 -0.827328 0.456657
C  3.606191 0.938244 -1.110823
C  -6.046854 -0.560216 -0.633957
C  -1.010494 2.560272 1.031511
C  7.054994 -0.107795 -0.152306
H  -4.668192 1.744005 -0.110665
H  -1.680083 -2.25234 -0.622308
H  -4.171985 -2.519114 -0.828983
H  2.695032 -1.930036 1.4016
H  1.465694 1.176249 -1.363078
H  5.1007 -1.394551 0.966825
H  3.887396 1.729425 -1.811628
H  -6.379235 -1.610048 -0.840385
H  -0.062594 2.396157 0.494423
H  -1.05513 1.906319 1.922206
H  -1.099608 3.614188 1.33671
H  7.044036 -1.182267 -0.41608
H  7.032878 0.010607 0.94757
H  7.95863 0.366863 -0.560054
