program: Gaussian 09
title: 000222141
version: EM64L-G09RevD.01
frameworkgroup: C1[X(C13H18O3)]
method: RPBEPBE
basis: SDD
operation: Freq
keyword: #pfreq=noraman
keyword: PBEPBE/SDD
title: #p freq=noraman PBEPBE/SDD
converged: YES YES NO NO
title: Mulliken charges:
elementType: O O O C C C C C C C C C C C C C H H H H H H H H H H H H H H H H H H
charge: -0.450829 -0.254486 -0.256362 -0.233373 0.551572 0.373501 -0.462656 -0.396714 -0.692446 -0.691441 -0.297239 -0.361934 -0.407121 0.222886 -0.261317 -0.658544 0.206561 0.231161 0.228687 0.226485 0.211377 0.211791 0.211646 0.211023 0.227612 0.263253 0.248509 0.263920 0.364804 0.227340 0.239681 0.221040 0.251272 0.230341
chargesum: 0.00000
title: Mulliken charges with hydrogens summed into heavy atoms:
elementType: O O O C C C C C C C C C C C C C
charge: -0.086025 -0.254486 -0.256362 -0.026813 0.551572 0.373501 -0.231495 -0.168027 -0.042793 -0.041160 -0.033986 -0.113424 -0.143201 0.222886 0.205704 0.044108
polarizability: 1.99063799e+02 -1.68422648e+00 1.40868434e+02 5.65311805e+00 1.29550788e+01 1.11393106e+02
1716.lowfreq: -18.3414 -3.3000 -0.0005 -0.0002 0.0005 5.0344 14.9120 21.6625 40.9526
frequency: -6.5822 21.4707 40.7322 46.0132 73.5437 89.4648 124.7016 147.9910 179.1745 204.7615 217.0013 236.3834 251.4950 270.8941 275.5423 324.3354 343.2507 378.0894 396.4081 414.8924 429.4234 438.3678 498.3973 549.1605 561.2054 623.8706 639.5837 688.3513 723.3508 756.8846 796.1425 812.2346 819.2194 852.0251 865.9226 890.1964 895.1347 919.1706 954.8161 963.3923 983.9518 999.8997 1012.4131 1025.0609 1052.8087 1096.3995 1113.1162 1114.0952 1153.3659 1154.8675 1159.9985 1173.7032 1197.3865 1220.6573 1229.3444 1265.2811 1275.8106 1292.7034 1310.0911 1328.9323 1351.9953 1371.4869 1378.2471 1389.2448 1391.6872 1396.9309 1410.3438 1457.1271 1463.2187 1466.2259 1468.1946 1478.8405 1483.3657 1483.9368 1501.7555 1583.1910 1615.5992 1622.3032 2974.0405 2976.5884 2978.2346 2994.9889 3033.9325 3035.1218 3067.0756 3074.0159 3076.9315 3081.3368 3090.4884 3097.2604 3115.7765 3120.8043 3123.9724 3145.1804 3162.8947 3459.2871
redmass: 2.9264 3.2134 3.3649 3.5032 5.1527 4.5640 4.5017 4.0283 2.0863 1.4661 1.3820 1.2197 1.9689 2.7685 3.3719 3.8427 4.3168 3.3375 2.0057 2.3051 2.6458 2.3941 3.1227 2.7909 3.9310 5.5251 6.0154 3.8502 3.1776 3.7024 1.7542 2.6432 2.1270 1.3576 2.1354 2.5650 3.4878 1.1862 1.4418 1.3840 1.3606 2.9157 3.0100 4.0766 1.5593 2.1793 2.4782 1.5704 2.0499 1.7333 2.1300 1.8820 1.3439 2.0348 1.6729 1.3511 1.1291 1.5977 1.3195 1.6358 1.2557 1.4488 1.1956 2.9491 1.2427 1.2767 2.3326 1.0972 1.0452 1.0447 1.0510 1.0481 1.1459 1.0521 2.1477 6.7572 7.2795 7.1084 1.0348 1.0412 1.0779 1.0361 1.0802 1.0634 1.1000 1.0992 1.1005 1.0997 1.0973 1.1033 1.0879 1.0890 1.1069 1.0952 1.0938 1.0649
irintensity: 0.5201 0.3976 0.0058 0.7433 0.1173 2.1659 0.4912 1.4731 0.1363 1.7592 1.3798 0.6766 1.3191 0.5310 8.9276 33.7433 10.3645 11.4092 36.8380 26.8817 32.3623 44.3491 3.4982 24.3300 6.1554 8.5244 5.3697 26.7666 4.1835 2.9669 0.9170 16.8126 16.7544 2.1324 22.3337 2.2115 15.8393 3.1918 0.0155 0.3032 0.7856 45.2554 9.8349 144.7377 29.2976 18.1896 0.8907 6.6769 96.7988 0.0971 158.5869 14.2723 5.7639 2.9520 141.9433 2.1356 10.4612 8.8579 0.7581 3.0925 3.0844 39.1803 15.9283 12.3142 23.1003 7.2686 14.1174 13.0125 13.9705 2.9706 2.8926 17.3797 2.9070 13.5186 44.9823 0.4574 85.3672 64.1829 32.4141 37.8473 18.8591 18.4487 11.8949 21.3249 0.2839 103.2789 24.9692 40.4485 29.9617 1.2125 15.1253 20.8411 26.4303 12.9235 4.2583 39.6702
temp: 298.150 k
press: 1.00000 atm
elementType: 8 8 8 6 6 6 6 6 6 6 6 6 6 6 6 6 1 1 1 1 1 1 1 1 1 1 1 1 1 1 1 1 1 1
symmnumber: 1
zpe: 740455.6 jmol-1
zpe.correction: 0.282025 hartree
zpe.thermalcorrener: 0.298502 hartree
zpe.thermalcorrenthalpy: 0.299446 hartree
zpe.thermalcorrgfe: 0.236795 hartree
zpe.sumelectzpe: -730.632942 hartree
zpe.sumelectthermal: -730.616465 hartree
zpe.sumelectthermalent: -730.615521 hartree
zpe.sumelectthermalfe: -730.678172 hartree
dipole: -0.4530 -3.4301 0.0187
dipole: 3.4599
quadrupole: -81.4697 -95.5309 -98.9555
quadrupole: 8.5398 2.6840 3.3327
quadrupole: 10.5157 -3.5456 -6.9701 8.5398 2.6840 3.3327
hfenergy: -730.9149669 hartree
pointgroup: C01 [X(C13H18O3)]
dipole: 0.0463835 -1.3341997 0.2659321 debye
polarizability: 196.1791715|0.9243712|134.7169507|15.7592832|-17.9924056|120.429216 unknown
InChI: InChI=1S/C13H18O3/c1-4-16-13(15)12(14)11-7-5-10(6-8-11)9(2)3/h5-9,12,14H,4H2,1-3H3
charge 0 multiplicity 1
34 atoms
O  1.814471 2.320274 -0.017115
O  2.632623 -1.072696 0.985327
O  3.176214 0.143271 -0.933784
C  -4.04362 -0.748148 -0.436975
C  -2.609857 -0.284375 -0.164935
C  0.071932 0.573426 0.349497
C  -1.790341 -0.964772 0.771199
C  -2.058585 0.839489 -0.833045
C  -4.233878 -1.177879 -1.91647
C  -5.08031 0.337602 -0.041334
C  1.510471 1.051935 0.628164
C  -0.466611 -0.54589 1.028844
C  -0.738166 1.267366 -0.578832
C  2.52935 0.006607 0.134909
C  3.565703 -2.177148 0.570703
C  4.98819 -1.883315 1.050338
H  -4.2326 -1.637958 0.197466
H  -2.195184 -1.832728 1.306801
H  -2.667783 1.394862 -1.556549
H  -3.524459 -1.977867 -2.194768
H  -5.261919 -1.549575 -2.08449
H  -4.066742 -0.325531 -2.601072
H  -4.953129 1.249857 -0.65352
H  -6.110598 -0.033095 -0.19763
H  -4.971616 0.626045 1.019624
H  1.650112 1.193862 1.714578
H  0.149457 -1.092734 1.751755
H  -0.329583 2.15291 -1.074901
H  2.314742 2.113017 -0.854938
H  3.135271 -3.067777 1.054754
H  3.517497 -2.276107 -0.527489
H  5.642881 -2.741874 0.811576
H  5.396362 -0.990327 0.548545
H  5.012507 -1.724924 2.142071
