program: Gaussian 09
title: 000222139
version: EM64L-G09RevD.01
frameworkgroup: C1[X(C7H2BrF3I2)]
method: RPBEPBE
basis: SDD
operation: Freq
keyword: #p
keyword: freq=noraman
keyword: PBEPBE/SDD
title: #p freq=noraman PBEPBE/SDD
converged: YES YES NO NO
title: Mulliken charges:
elementType: I I Br F F F C C C C C C C H H
charge: 0.197813 0.199971 0.093917 -0.161887 -0.146898 -0.146898 0.378096 -0.449450 -0.277294 0.259077 -0.076300 -0.137054 -0.316529 0.297356 0.286080
chargesum: 0.00000
title: Mulliken charges with hydrogens summed into heavy atoms:
elementType: I I Br F F F C C C C C C C
charge: 0.197813 0.199971 0.093917 -0.161887 -0.146898 -0.146898 0.378096 -0.449450 0.020062 0.259077 0.209780 -0.137054 -0.316529
polarizability: 2.25081480e+02 -1.29647266e+01 1.49918203e+02 5.13589592e-04 7.27604470e-04 4.98674793e+01
1716.lowfreq: -6.8863 -0.0004 0.0003 0.0004 4.5762 6.2744 30.4590 44.6253 90.4892
frequency: 30.2919 44.5917 90.4796 91.6901 114.6678 120.6521 161.2681 175.0770 193.7256 242.5968 263.5913 363.8034 374.1975 418.2784 433.8989 456.6398 492.4721 546.1853 615.5970 625.6878 662.2803 705.6900 769.6938 888.2839 911.2147 970.7824 1002.8407 1017.5077 1053.9429 1116.9127 1234.9636 1272.8829 1310.6065 1347.7457 1430.5800 1522.4362 1563.5150 3178.3989 3185.9209
redmass: 37.2595 19.4370 11.5646 54.5440 51.4214 25.0149 6.1742 51.2008 25.3461 9.6094 17.5783 11.6714 11.4999 9.5256 3.9048 10.6028 9.0030 9.7266 10.1380 12.3091 8.7489 4.5457 12.1103 1.3934 1.4129 10.0932 10.9879 10.6310 7.9363 2.3954 4.2138 1.1911 6.9756 11.5731 2.5327 10.3268 7.0111 1.0928 1.0920
irintensity: 0.0932 0.2018 0.0379 0.0626 0.3080 0.7426 0.6629 0.1236 0.2151 0.0776 1.7027 2.1770 4.0346 1.9378 8.7786 33.3547 9.0210 14.0632 0.0005 2.2592 0.7801 0.8122 4.8332 3.1384 59.0167 213.0234 214.7070 97.8493 95.3978 109.5412 228.4709 0.1966 148.4227 8.5718 69.9128 7.0827 87.1431 0.6076 3.4763
temp: 298.150 k
press: 1.00000 atm
elementType: 53 53 35 9 9 9 6 6 6 6 6 6 6 1 1
symmnumber: 1
zpe: 185430.7 jmol-1
zpe.correction: 0.070627 hartree
zpe.thermalcorrener: 0.083740 hartree
zpe.thermalcorrenthalpy: 0.084685 hartree
zpe.thermalcorrgfe: 0.026137 hartree
zpe.sumelectzpe: -602.997654 hartree
zpe.sumelectthermal: -602.984541 hartree
zpe.sumelectthermalent: -602.983596 hartree
zpe.sumelectthermalfe: -603.042144 hartree
dipole: -1.9135 -1.8643 0.0000
dipole: 2.6715
quadrupole: -114.0690 -108.1609 -115.0687
quadrupole: -5.9576 0.0002 0.0002
quadrupole: -1.6361 4.2720 -2.6359 -5.9576 0.0002 0.0002
hfenergy: -603.0682811 hartree
pointgroup: C01 [X(C7H2Br1F3I2)]
dipole: 0.9460044 -0.4580113 -0.0009211 debye
dipolederiv: -0.1603945 -0.2333823 0.0001043 -0.3230452 -0.2326358 0.0001531 0.0000577 0.0000715 0.0846924 -0.4495745 0.1044836 0.0004554 0.187683 0.0566052 -0.0001599 0.0004941 -0.0000918 0.0773964 -0.2121472 -0.3268122 0.000106 -0.3312227 -0.4264617 0.0001462 0.0001144 0.0001534 0.0278987 -0.4591806 0.1761315 0.0002218 0.135583 -0.7725902 -0.0003957 0.0001824 -0.000408 -0.2842907 -0.693459 0.0482951 -0.2426845 -0.0253136 -0.3098895 -0.1174358 -0.2552972 -0.0780888 -0.6228738 -0.692636 0.0481406 0.2428178 -0.0254219 -0.3101203 0.1178003 0.2552963 0.0783476 -0.6233777 -0.6455237 -0.1054577 0.000395 0.0786817 -0.2520996 -0.0001293 0.000486 -0.0000163 -0.1020247 0.6094934 0.6818173 -0.0003404 0.4032245 0.6674391 -0.00001 -0.0004136 -0.0001996 -0.15584 0.0242867 -0.2493002 -0.0001065 0.002485 -0.2535486 -0.0000683 -0.0000542 0.000162 -0.0349624 2.0884587 -0.4018495 -0.0005865 -0.2030194 1.3922826 0.0001186 -0.0004336 0.0002482 1.545678 -0.6847307 -0.1542704 0.0004732 -0.1895067 -0.2033586 0.0000726 0.0004748 0.0000233 -0.0144141 0.0606078 0.9670928 0.000138 0.5576596 0.6378907 -0.0002718 0.0000126 -0.0006246 -0.0890341 1.0425998 -0.5549004 -0.001105 -0.2793059 -0.0462839 0.0002649 -0.0010379 0.0005035 -0.1249911 0.0947335 -0.0083427 0.0000469 -0.0096065 0.0435137 -0.0000267 0.0000591 -0.0000232 0.1610249 0.0774666 0.0083544 0.0000644 0.0211251 0.0092568 -0.0000583 0.0000591 -0.000057 0.1551181 unknown
polarizability: 209.8042336|32.9085861|165.1953522|-0.1175805|0.0096842|49.8675763 unknown
InChI: InChI=1S/C7H2BrF3I2/c8-4-1-3(7(9,10)11)5(12)2-6(4)13/h1-2H
charge 0 multiplicity 1
15 atoms
I  -1.586965 -2.881644 0.000259
I  4.174025 -1.087033 -0.003692
Br 2.958381 2.3395 -0.001771
F  -2.243796 1.972807 0.002815
F  -2.810368 0.099743 -1.131766
F  -2.808652 0.098471 1.136153
C  -0.649865 0.142316 0.000597
C  -0.235786 -1.217049 -0.00016
C  0.330462 1.160742 0.0001
C  -2.100365 0.564123 0.00192
C  1.142092 -1.526117 -0.001326
C  1.70511 0.851522 -0.001115
C  2.1203 -0.501609 -0.001821
H  0.011666 2.205531 0.00068
H  1.462561 -2.570303 -0.001874
