program: Gaussian 09
title: 000222126
version: EM64L-G09RevD.01
frameworkgroup: C1[X(C21H25ClO3)]
method: RPBEPBE
basis: SDD
operation: Freq
keyword: #p
keyword: freq=noraman
keyword: PBEPBE/SDD
title: #p freq=noraman PBEPBE/SDD
converged: YES YES NO NO
title: Mulliken charges:
elementType: Cl O O O C C C C C C C C C C C C C C C C C C C C C H H H H H H H H H H H H H H H H H H H H H H H H H
charge: -0.062763 -0.291486 -0.358220 -0.213151 -0.381066 -0.371346 -0.374560 -0.353204 -0.378370 -0.356268 -0.311112 -0.696158 0.140375 0.162188 0.251321 -0.040475 0.244934 -0.291945 -0.360361 -0.119179 -0.390989 -0.438343 -0.222004 -0.218099 -0.234871 0.193742 0.198122 0.189089 0.191447 0.201102 0.190906 0.189106 0.188012 0.232795 0.206511 0.195485 0.194544 0.230739 0.224359 0.210183 0.215278 0.209656 0.300889 0.276664 0.253200 0.292428 0.233328 0.235863 0.374715 0.236988
chargesum: 0.00000
title: Mulliken charges with hydrogens summed into heavy atoms:
elementType: Cl O O O C C C C C C C C C C C C C C C C C C C C C
charge: -0.062763 -0.291486 0.016495 -0.213151 0.010798 0.009190 0.017449 0.023914 0.060935 0.033761 0.143985 -0.061041 0.140375 0.162188 0.251321 -0.040475 0.244934 0.008944 -0.083696 -0.119179 -0.137789 -0.145914 0.011324 0.017764 0.002117
polarizability: 3.59540137e+02 -2.59499524e+01 2.62025323e+02 -1.63080197e+01 1.72309665e+00 1.61158161e+02
1716.lowfreq: -15.6287 -3.8010 -0.0013 -0.0006 0.0012 3.5149 9.0151 14.5204 18.6366
frequency: -7.8659 12.9868 18.4092 33.8929 41.5017 49.4261 60.9018 68.7438 73.5073 83.7585 96.2194 116.8044 125.5526 137.1013 140.2063 145.6148 163.9077 201.9964 212.5527 234.3438 252.5398 270.6886 291.7820 296.7809 312.0115 337.3968 352.1478 374.4729 402.2920 408.2126 417.4683 447.1829 463.7421 507.8361 509.4527 536.4741 569.9993 598.5995 616.0392 626.8447 671.3052 700.9192 711.5735 720.7059 730.2903 733.1709 754.4919 765.3780 785.9545 789.2310 808.8829 829.6540 864.1931 864.4995 888.1261 889.9665 916.0498 926.0065 935.9126 941.0516 985.0076 989.6027 990.9825 1002.2913 1009.6079 1013.4249 1021.6376 1036.4796 1046.0211 1071.8995 1076.5181 1080.2382 1082.2774 1102.6712 1111.4054 1122.5267 1166.1284 1176.2254 1191.1791 1194.8678 1199.3421 1218.2903 1222.9360 1230.9187 1263.1263 1267.4314 1273.7672 1278.9549 1288.3907 1293.9352 1295.9945 1299.0218 1305.5902 1315.1831 1339.0309 1354.1087 1356.8953 1365.2981 1371.8306 1375.0451 1389.8660 1406.9002 1428.8658 1450.8473 1453.1487 1460.9665 1461.8153 1466.3693 1470.7166 1477.6733 1478.1089 1484.6220 1487.1487 1488.3752 1573.6628 1584.7372 1600.5673 1610.3941 1633.2401 2951.0694 2953.3875 2956.0100 2963.0327 2968.4016 2971.7526 2985.3457 2989.2768 2994.7363 3006.4301 3019.8773 3023.2763 3037.9363 3053.0984 3068.2366 3070.4510 3098.5233 3124.9438 3130.6686 3142.2040 3152.6602 3163.4678 3168.7320 3196.6217 3460.3955
redmass: 2.9936 3.7279 3.4490 3.3782 4.0979 5.0172 4.4853 4.9006 5.0045 1.7141 3.1147 4.5412 7.1283 1.9860 2.6087 3.6155 4.2144 5.9058 5.3640 1.1151 4.9724 5.2062 3.4128 5.0721 5.2115 4.9240 11.8656 6.7445 2.7093 7.7122 3.5777 3.5916 3.6889 1.7683 3.5725 1.9027 4.0876 5.1181 6.5037 6.0519 6.3104 6.7989 1.9363 1.0659 1.0942 4.3772 1.1674 2.2250 3.4815 1.7984 2.3791 6.5711 1.2512 1.2824 1.9280 1.4478 1.4953 4.4991 1.4149 1.2478 2.2727 2.2426 4.5278 1.3032 1.1490 4.2339 3.6856 2.6468 3.2581 2.7595 2.4625 2.1697 1.6841 2.0406 2.3446 2.8012 1.7896 1.0548 1.6519 1.1325 2.2614 1.2980 2.0447 1.3868 1.2866 1.2485 1.7434 1.0263 1.0980 1.1323 2.8706 1.1514 1.3043 1.4480 1.4095 1.6483 1.6009 3.6253 1.4125 5.9236 1.2171 4.0760 2.7777 2.0881 1.3488 1.0725 1.0749 1.0681 1.0798 1.0676 1.0541 1.0872 2.5194 1.0936 6.1925 6.5783 7.3110 6.0361 10.5263 1.0587 1.0586 1.0591 1.0592 1.0584 1.0367 1.0957 1.0631 1.0962 1.1016 1.0575 1.1040 1.1044 1.1036 1.1007 1.0993 1.1083 1.0870 1.0869 1.0918 1.0963 1.0928 1.1016 1.0927 1.0651
irintensity: 0.0670 0.1449 0.8045 0.5947 0.4527 0.5106 0.1132 0.1401 0.1622 0.0477 0.0630 0.5097 0.2192 0.1004 0.0081 0.1817 0.6124 0.7468 1.5513 0.0020 1.7434 0.2956 1.1584 4.3568 3.7398 13.7395 1.7045 1.3023 2.7331 0.7266 2.8151 2.9069 4.0488 56.7806 0.6301 85.6549 1.2113 13.8756 2.6445 14.5688 47.0375 3.3020 35.2401 15.7574 1.3462 26.6623 8.5976 16.5523 31.0427 6.9102 9.5033 9.6203 2.1923 0.3176 2.4834 16.0943 8.6047 37.5765 1.5823 2.2294 4.7996 3.5628 1.8980 0.6223 3.5289 54.4360 30.2196 201.6903 28.7339 23.5862 0.7357 0.3786 4.4966 47.6297 248.4181 0.5601 27.9671 0.1028 26.8473 2.0345 148.8492 22.6437 131.4127 1.8482 3.1999 2.5050 2.6882 0.5458 0.8971 1.9415 72.8867 0.8729 4.1237 20.4994 2.4967 0.6675 0.2875 66.1042 0.8981 24.5278 11.3587 13.7473 28.2569 57.9456 28.2867 0.1242 0.6355 0.1256 1.6912 4.9866 9.1992 2.6826 7.6177 31.1479 24.2271 3.7454 58.3381 7.8108 141.8771 0.0243 3.7910 0.5370 22.1499 152.7601 35.3646 0.0816 22.6933 3.1712 1.6175 54.3460 0.0250 87.9742 57.5928 94.7416 56.5964 27.6736 4.1943 1.0032 8.5615 24.5940 0.2190 24.6324 4.7104 109.8478
temp: 298.150 k
press: 1.00000 atm
elementType: 17 8 8 8 6 6 6 6 6 6 6 6 6 6 6 6 6 6 6 6 6 6 6 6 6 1 1 1 1 1 1 1 1 1 1 1 1 1 1 1 1 1 1 1 1 1 1 1 1 1
symmnumber: 1
zpe: 1072340.9 jmol-1
zpe.correction: 0.408433 hartree
zpe.thermalcorrener: 0.433574 hartree
zpe.thermalcorrenthalpy: 0.434518 hartree
zpe.thermalcorrgfe: 0.349481 hartree
zpe.sumelectzpe: -1499.118506 hartree
zpe.sumelectthermal: -1499.093365 hartree
zpe.sumelectthermalent: -1499.092421 hartree
zpe.sumelectthermalfe: -1499.177458 hartree
dipole: 2.1238 -0.9956 -0.2778
dipole: 2.3620
quadrupole: -116.1043 -159.4332 -158.3827
quadrupole: -14.8826 -2.6980 6.6884
quadrupole: 28.5358 -14.7931 -13.7427 -14.8826 -2.6980 6.6884
hfenergy: -1499.526939 hartree
pointgroup: C01 [X(C21H25Cl1O3)]
dipole: -0.8457052 -0.1632952 0.348833 debye
polarizability: 360.4893082|1.519855|207.4727675|-30.0756059|-49.2405228|214.7615461 unknown
InChI: InChI=1S/C21H25ClO3/c1-2-3-4-5-6-10-13-25-21(24)19-15-17(22)14-18(20(19)23)16-11-8-7-9-12-16/h7-9,11-12,14-15,23H,2-6,10,13H2,1H3
charge 0 multiplicity 1
50 atoms
Cl -2.328873 3.598421 -2.739165
O  1.100011 -0.262657 -1.971126
O  -2.211964 -1.614467 0.278898
O  0.53213 -1.577246 -0.126918
C  5.845712 0.02108 -0.209171
C  7.264341 -0.591255 -0.225947
C  4.842508 -0.741423 -1.104088
C  8.269436 0.172073 0.665872
C  3.422102 -0.130775 -1.062007
C  9.687877 -0.442409 0.653331
C  2.451644 -0.893638 -1.973919
C  10.685422 0.325223 1.547704
C  -1.060532 0.074375 -1.020857
C  0.222802 -0.689527 -0.953489
C  -3.437802 0.412225 -0.383985
C  -2.239349 -0.373955 -0.352482
C  -4.665859 -0.039869 0.33725
C  -1.102707 1.292268 -1.751518
C  -3.449022 1.616647 -1.124295
C  -2.288122 2.035409 -1.798486
C  -5.925268 -0.062253 -0.32127
C  -4.605979 -0.433117 1.705939
C  -7.08985 -0.471151 0.36326
C  -5.772853 -0.845362 2.387747
C  -7.017806 -0.869776 1.718779
H  5.898894 1.080079 -0.537468
H  5.465379 0.03706 0.833276
H  7.64337 -0.612034 -1.269443
H  7.210645 -1.649238 0.106145
H  4.798433 -1.801961 -0.780534
H  5.216598 -0.746558 -2.14948
H  7.890796 0.19511 1.709337
H  8.326858 1.22988 0.333484
H  3.038036 -0.155841 -0.024694
H  3.461251 0.930593 -1.375993
H  9.629419 -1.499361 0.984779
H  10.065574 -0.464723 -0.389504
H  2.351272 -1.94584 -1.65139
H  2.761172 -0.846093 -3.031509
H  10.348063 0.332422 2.601501
H  11.691997 -0.131275 1.518365
H  10.781688 1.377837 1.220409
H  -0.201096 1.624737 -2.268798
H  -4.354446 2.230343 -1.145128
H  -5.982253 0.225206 -1.377296
H  -3.659446 -0.357251 2.254797
H  -8.051363 -0.484833 -0.161564
H  -5.709783 -1.13439 3.442572
H  -3.118855 -1.840955 0.622643
H  -7.921797 -1.190052 2.247836
