program: Gaussian 09
title: 000019206
version: EM64L-G09RevD.01
frameworkgroup: C1[X(C16H9Cl3N4O2)]
method: RPBEPBE
basis: SDD
operation: Freq
keyword: #p
keyword: freq=noraman
keyword: PBEPBE/SDD
title: #p freq=noraman PBEPBE/SDD
converged: YES YES NO NO
title: Mulliken charges:
elementType: Cl Cl Cl O O N N N N C C C C C C C C C C C C C C C C H H H H H H H H H
charge: 0.104612 0.146773 0.114657 -0.201710 -0.191046 -0.043116 -0.000811 0.031782 0.022688 0.334083 -0.067080 -0.035269 0.286758 -0.457502 -0.356821 0.374436 0.224890 -0.189133 -0.361903 -0.345479 -0.334553 -0.789268 -0.226516 -0.229079 -0.220112 0.334261 0.278221 0.244895 0.292452 0.264903 0.284987 0.234650 0.237413 0.236934
chargesum: 0.00000
title: Mulliken charges with hydrogens summed into heavy atoms:
elementType: Cl Cl Cl O O N N N N C C C C C C C C C C C C C C C C
charge: 0.104612 0.146773 0.114657 -0.201710 -0.191046 -0.043116 -0.000811 0.031782 0.022688 0.334083 -0.067080 -0.035269 0.286758 -0.123241 -0.078599 0.374436 0.224890 0.055762 -0.069450 -0.080576 -0.049565 -0.789268 0.008134 0.008334 0.016822
polarizability: 3.99720201e+02 2.21281322e+01 2.84128064e+02 3.01013293e-01 -7.53470698e-01 1.14535600e+02
1716.lowfreq: -5.3583 -0.0020 0.0005 0.0013 2.2719 3.9155 7.5111 19.4228 35.8697
frequency: 6.5870 19.4040 35.8662 43.5963 49.7347 57.8567 71.3486 96.1579 103.7426 138.5163 169.8045 177.5558 197.8427 204.2429 216.8073 229.4419 234.4833 266.8606 286.2416 292.3716 361.1858 377.1652 399.3082 402.5893 425.6294 429.8160 448.7331 491.0157 510.0594 568.9600 612.6402 622.7545 625.9755 644.4179 662.2553 662.9490 695.0179 698.7303 712.3946 722.7491 755.5957 766.7803 789.9256 799.1459 832.7830 862.4602 865.6378 868.2322 916.1502 948.6349 961.9406 969.6535 984.8119 988.6673 990.1670 1000.7393 1014.1980 1016.1158 1021.3081 1070.7925 1079.6669 1082.3629 1099.9690 1128.9757 1169.9354 1175.1833 1179.5552 1184.1340 1216.4007 1261.4390 1275.8886 1316.8917 1341.7470 1375.6624 1390.2711 1393.7800 1407.4254 1422.3489 1434.0767 1453.7574 1466.2307 1483.0211 1496.3514 1585.0326 1586.7697 1611.7227 1615.7653 3133.9059 3146.5280 3155.6609 3159.7383 3171.1527 3176.3147 3177.8052 3185.4650 3188.0658
redmass: 26.8138 7.3989 4.1176 9.4560 11.2327 9.9667 8.2035 7.0401 10.6097 12.9336 5.6615 14.8193 12.0423 7.1903 12.2929 6.5424 6.5532 12.4595 8.5939 17.1350 13.9984 11.8168 10.1662 2.8380 3.2279 8.7392 3.9220 5.2666 8.2769 7.5785 6.5529 10.4893 8.0782 8.0237 5.6070 8.6400 2.1916 2.5675 9.9170 2.6370 11.1478 5.4372 10.9221 2.7103 1.6937 5.3922 1.2484 7.3169 13.4417 8.4182 1.4399 1.3998 1.4837 6.2407 6.2779 1.3806 1.3440 1.3710 2.3149 1.7404 1.7277 1.5942 4.2419 4.1529 1.1851 1.0660 2.5272 1.5260 9.6371 3.6122 1.6996 1.4532 4.4280 7.8010 6.3281 8.3987 6.2962 4.0700 3.2239 3.5016 7.3510 3.1592 3.6177 6.6052 6.6788 6.1496 7.1480 1.0858 1.0894 1.0883 1.0939 1.0952 1.0931 1.0996 1.0929 1.0976
irintensity: 0.0581 1.2442 0.0613 0.0061 0.1739 0.6816 0.3194 0.0295 0.8721 0.6908 1.3123 3.0057 0.5863 0.1199 0.0293 0.1325 0.0574 1.0002 0.2336 0.3360 0.5049 0.2396 0.6530 0.0078 0.3527 0.1967 3.4047 9.9958 1.1358 9.8578 1.5038 60.4971 33.3779 36.6273 10.9498 47.0461 27.6667 16.5413 50.7652 103.1039 56.6687 118.3501 52.0153 10.2272 13.6622 1.4776 0.0055 0.6263 8.4115 14.8668 3.2293 0.1083 15.6354 2.6090 1.2743 0.0357 0.0986 0.8420 18.3751 29.4432 23.4330 36.9243 6.5148 9.0022 90.0192 0.0439 17.5563 16.2954 305.8680 10.5436 16.7008 5.9626 225.3369 82.0870 3.0941 69.1387 54.4449 204.0303 103.0931 243.6976 847.2717 88.4546 20.1653 9.8560 7.5047 42.5255 15.7523 0.0499 10.5949 6.3673 18.2476 7.5865 5.7780 22.5947 5.9465 9.3377
temp: 298.150 k
press: 1.00000 atm
elementType: 17 17 17 8 8 7 7 7 7 6 6 6 6 6 6 6 6 6 6 6 6 6 6 6 6 1 1 1 1 1 1 1 1 1
symmnumber: 1
zpe: 580939.8 jmol-1
zpe.correction: 0.221268 hartree
zpe.thermalcorrener: 0.242846 hartree
zpe.thermalcorrenthalpy: 0.243790 hartree
zpe.thermalcorrgfe: 0.165688 hartree
zpe.sumelectzpe: -2362.914366 hartree
zpe.sumelectthermal: -2362.892789 hartree
zpe.sumelectthermalent: -2362.891844 hartree
zpe.sumelectthermalfe: -2362.969946 hartree
dipole: -4.7778 -6.5775 -0.0406
dipole: 8.1297
quadrupole: -175.5599 -149.3676 -165.6194
quadrupole: -3.0541 0.2668 -0.3592
quadrupole: -12.0442 14.1480 -2.1038 -3.0541 0.2668 -0.3592
hfenergy: -2363.1356341 hartree
pointgroup: C01 [X(C16H9Cl3N4O2)]
dipole: -2.0568889 2.4458902 -0.1303633 debye
polarizability: 401.5826853|-15.0316971|279.8587877|-12.7789197|-16.7392003|116.9423916 unknown
InChI: InChI=1S/C16H9Cl3N4O2/c17-16(18,19)15-21-13(10-5-2-1-3-6-10)20-14(22-15)11-7-4-8-12(9-11)23(24)25/h1-9H
charge 0 multiplicity 1
34 atoms
Cl -1.610326 -4.052743 -1.151806
Cl 0.849095 -4.111436 0.601025
Cl -1.870205 -3.814357 1.863343
O  6.507927 0.660525 -0.371653
O  5.330132 -1.27282 -0.096967
N  -0.739487 0.865942 -0.030849
N  0.44448 -1.24104 0.128636
N  -1.968014 -1.199839 0.242843
N  5.402942 0.005368 -0.243589
C  1.708648 0.833284 -0.154887
C  0.410256 0.131193 -0.014063
C  -1.919551 0.168411 0.098344
C  -3.193847 0.912707 0.083201
C  2.914315 0.089337 -0.131177
C  1.7506 2.244873 -0.31292
C  4.131138 0.780645 -0.267254
C  -0.76704 -1.83157 0.253556
C  2.98647 2.910828 -0.447209
C  4.195111 2.182898 -0.425947
C  -3.198929 2.326613 -0.068769
C  -4.42487 0.213618 0.222133
C  -0.81885 -3.360355 0.395163
C  -4.419325 3.029774 -0.08187
C  -5.641988 0.922481 0.208145
C  -5.643123 2.330474 0.056282
H  2.893192 -0.996548 -0.009999
H  0.805868 2.79557 -0.327553
H  3.011043 3.998039 -0.568798
H  5.169025 2.668854 -0.528015
H  -2.243596 2.848627 -0.174028
H  -4.40107 -0.873748 0.338377
H  -4.421561 4.11865 -0.198967
H  -6.588682 0.382659 0.315223
H  -6.591374 2.879385 0.045849
