program: Gaussian 09
title: 000222118
version: EM64L-G09RevD.01
frameworkgroup: C1[X(C17H24N2O4)]
method: RPBEPBE
basis: SDD
operation: Freq
keyword: #p
keyword: freq=noraman
keyword: PBEPBE/SDD
title: #p freq=noraman PBEPBE/SDD
converged: YES YES NO NO
title: Mulliken charges:
elementType: O O O O N N C C C C C C C C C C C C C C C C C H H H H H H H H H H H H H H H H H H H H H H H H
charge: -0.384445 -0.376645 -0.227765 -0.212378 -0.382069 0.002917 -0.206963 -0.441600 -0.440666 -0.400557 -0.400122 -0.386343 0.516585 -0.132728 -0.590577 0.240580 0.398056 -0.549543 0.226656 -0.390070 -0.337724 -0.351599 -0.682305 0.270244 0.216131 0.196359 0.198969 0.217568 0.202431 0.197922 0.198341 0.202755 0.201713 0.190568 0.294807 0.254601 0.396395 0.327447 0.268789 0.219570 0.201259 0.216553 0.188347 0.199272 0.211200 0.222701 0.215362
chargesum: 0.00000
title: Mulliken charges with hydrogens summed into heavy atoms:
elementType: O O O O N N C C C C C C C C C C C C C C C C C
charge: 0.011950 -0.376645 -0.227765 -0.212378 -0.054621 0.002917 0.063281 -0.029110 -0.024129 -0.000204 0.000974 0.005938 0.516585 -0.132728 -0.295770 0.240580 0.398056 -0.294942 0.226656 0.098288 0.080088 0.036020 -0.033041
polarizability: 3.02479505e+02 -1.61484459e+00 2.47555060e+02 1.04121999e+01 2.46442979e+00 1.40925481e+02
1716.lowfreq: -0.0005 0.0005 0.0007 4.0372 6.9510 12.0041 16.8035 26.2590 38.5175
frequency: 15.3405 25.3426 38.1297 42.7041 61.4848 64.6787 77.3121 87.7100 107.9746 121.2048 130.8292 164.3379 167.5213 205.2467 222.4189 226.3886 236.4354 260.1617 270.5583 276.3533 324.5520 343.6314 356.4745 377.0588 397.2094 433.1328 436.3946 449.8603 478.9754 494.7530 512.6625 516.4817 554.4175 596.3161 604.9301 640.5009 680.4717 690.9117 717.2879 733.5397 751.8289 783.5447 785.6267 788.4709 799.6233 823.1955 848.1619 851.5920 879.8497 891.9787 902.8170 912.7476 918.4434 936.2325 953.8134 965.0980 976.6636 1012.6466 1026.2660 1045.0471 1052.4856 1055.5391 1073.0373 1082.4490 1098.1203 1114.7945 1120.1230 1132.9159 1137.4208 1174.8997 1180.6069 1206.7941 1223.7491 1227.1610 1236.6620 1254.0391 1259.6369 1261.7567 1274.6181 1289.3930 1296.5482 1307.1705 1312.1686 1319.9405 1334.8256 1339.2569 1342.1514 1345.5195 1349.6116 1351.8683 1356.3587 1359.3555 1369.0921 1394.7269 1423.4689 1444.1445 1451.3654 1458.4192 1459.4118 1462.5787 1463.2165 1469.4192 1470.5245 1473.6337 1476.9723 1478.9787 1486.1428 1527.2857 1577.4336 1604.6611 1637.9286 2499.2506 2959.2687 2963.9798 2965.6016 2967.0105 2969.0481 2969.4881 2978.0885 2982.4761 2987.4827 3004.2682 3011.8291 3026.8818 3028.9190 3035.0397 3035.3043 3046.6883 3047.3360 3074.6807 3080.4221 3090.3713 3154.3887 3167.6712 3570.3015
redmass: 3.8745 3.1133 4.9959 4.6845 9.0117 4.2068 1.7690 4.3070 3.5115 5.2906 6.6210 4.4919 3.3975 4.2957 2.3402 1.7916 1.4451 4.1413 2.4277 3.9124 2.6048 3.3105 4.9381 4.9215 4.5936 3.0978 3.9331 4.4562 1.8078 2.5672 5.1789 3.2993 3.9605 1.4165 4.2148 4.5186 7.2414 7.4842 6.4160 1.4481 2.6066 3.6191 1.6539 2.4636 5.5728 2.0246 1.9631 2.1958 1.8118 1.5663 2.4790 1.5444 1.7729 3.0169 1.5899 2.2093 1.6427 2.8713 1.0573 3.2823 1.7143 1.5514 1.1699 2.3186 2.2910 2.4390 2.0374 1.9674 2.1618 2.5639 1.5021 5.2983 1.6458 1.6052 1.4453 1.3436 1.4716 1.2661 1.7246 1.1229 2.4038 1.3325 1.2914 1.5884 1.3510 1.3496 1.4121 1.7431 1.8446 1.6672 2.9863 1.8255 1.6749 1.2106 3.2552 3.1107 3.2439 1.0857 1.0888 1.0895 1.0983 1.0876 1.1151 1.0627 1.1011 1.0430 1.0762 2.1514 7.3481 4.6515 3.1134 1.0759 1.0590 1.0622 1.0622 1.0610 1.0621 1.0654 1.0374 1.0592 1.0679 1.0995 1.0847 1.0968 1.0950 1.1028 1.1003 1.1020 1.1019 1.1007 1.0996 1.0963 1.0911 1.0916 1.0767
irintensity: 0.0287 0.1567 0.9051 4.0098 0.0597 0.5937 0.3921 2.2974 0.4794 5.6534 1.5066 2.2449 0.6538 0.4917 3.5054 0.1328 1.7377 0.0573 0.7200 0.3504 0.7365 0.2819 6.6866 1.0939 26.0410 0.8745 1.0082 24.3326 2.2988 8.2216 3.2441 0.8569 13.4886 74.5597 38.1148 3.3220 29.3998 18.9756 2.6738 9.7858 13.6728 1.0625 0.2538 0.4908 11.3829 2.2329 6.5608 5.1653 0.9972 17.6804 3.7009 7.4662 9.1475 26.7888 12.8569 1.5233 20.2268 9.4586 124.6062 1.8938 0.9023 0.1233 0.4351 10.9449 15.7726 0.0454 3.4578 14.0100 3.0298 2.3421 1.2902 376.1443 72.7609 97.7138 26.7790 29.1770 28.6891 1.8521 66.6561 4.3399 74.7189 35.6507 0.3440 67.4121 0.8220 1.0003 0.0749 75.0593 93.0723 6.7998 87.5074 3.6882 106.9232 9.5374 0.8631 195.9809 36.0318 4.3720 1.2794 10.3126 18.9634 22.9037 15.4752 9.9722 3.7620 11.6150 13.9843 363.2995 125.9805 96.5718 79.3863 966.2583 31.8893 19.8888 39.1302 36.7118 27.5247 24.0769 23.5270 56.3316 36.1437 7.6355 17.9875 91.2461 70.8115 0.7229 4.3193 48.4386 100.0654 77.5557 38.3363 3.9640 2.7408 3.1823 22.7847
temp: 298.150 k
press: 1.00000 atm
elementType: 8 8 8 8 7 7 6 6 6 6 6 6 6 6 6 6 6 6 6 6 6 6 6 1 1 1 1 1 1 1 1 1 1 1 1 1 1 1 1 1 1 1 1 1 1 1 1
symmnumber: 1
zpe: 1024072.3 jmol-1
zpe.correction: 0.390049 hartree
zpe.thermalcorrener: 0.412687 hartree
zpe.thermalcorrenthalpy: 0.413631 hartree
zpe.thermalcorrgfe: 0.335653 hartree
zpe.sumelectzpe: -1070.823782 hartree
zpe.sumelectthermal: -1070.801143 hartree
zpe.sumelectthermalent: -1070.800199 hartree
zpe.sumelectthermalfe: -1070.878177 hartree
dipole: -2.9989 -2.9819 -0.0301
dipole: 4.2292
quadrupole: -107.7077 -169.6192 -137.0007
quadrupole: 0.0512 2.5062 0.4296
quadrupole: 30.4015 -31.5100 1.1085 0.0512 2.5062 0.4296
hfenergy: -1071.2138305 hartree
pointgroup: C01 [X(C17H24N2O4)]
dipole: -1.1755431 1.1775169 -0.0059495 debye
polarizability: 302.5966887|1.3040377|247.5828591|-9.5574188|1.4617793|140.7804981 unknown
InChI: InChI=1S/C17H24N2O4/c1-2-3-9-18-17(21)15-11-13(19(22)23)10-14(16(15)20)12-7-5-4-6-8-12/h10-12,18,20H,2-9H2,1H3
charge 0 multiplicity 1
47 atoms
O  0.685074 2.242834 0.229495
O  -1.759305 2.490692 0.553529
O  -1.048674 -3.872331 0.493934
O  1.204672 -4.084278 0.191439
N  -3.193777 0.683764 0.751346
N  0.135835 -3.368709 0.330492
C  3.072297 0.716729 -0.079569
C  3.770598 0.272821 -1.398136
C  3.995857 0.426745 1.142018
C  5.14743 0.958657 -1.559318
C  5.373443 1.109632 0.978202
C  6.061884 0.685918 -0.34124
C  1.706178 0.068646 0.094443
C  0.534818 0.88411 0.252219
C  1.550878 -1.325044 0.122775
C  -0.770674 0.287223 0.430885
C  0.2705 -1.904784 0.301716
C  -0.882749 -1.118176 0.454445
C  -1.940704 1.202278 0.582354
C  -4.402439 1.524082 0.881309
C  -5.396698 1.328385 -0.285904
C  -5.992409 -0.096035 -0.382573
C  -7.046043 -0.218509 -1.504487
H  2.917299 1.811033 -0.129723
H  3.119652 0.509005 -2.261926
H  3.911064 -0.827993 -1.392354
H  4.138727 -0.669526 1.241129
H  3.503196 0.772523 2.071022
H  5.633681 0.609467 -2.490716
H  4.998322 2.053097 -1.665358
H  5.236393 2.21071 0.980583
H  6.018676 0.865104 1.844161
H  7.024552 1.219997 -0.458804
H  6.29896 -0.397559 -0.298323
H  2.410736 -1.991254 0.008054
H  -1.832001 -1.645876 0.589743
H  -0.280336 2.653276 0.358737
H  -3.317869 -0.328758 0.760026
H  -4.052715 2.568418 0.925527
H  -4.898202 1.284304 1.843057
H  -6.222364 2.054974 -0.14654
H  -4.897078 1.593582 -1.23798
H  -5.185219 -0.834701 -0.569499
H  -6.452832 -0.367148 0.589878
H  -7.886598 0.479994 -1.334283
H  -7.460742 -1.241087 -1.558382
H  -6.605095 0.020366 -2.490104
