program: Gaussian 09
title: 000222120
version: EM64L-G09RevD.01
frameworkgroup: C1[X(C17H34O3)]
method: RPBEPBE
basis: SDD
operation: Freq
keyword: #pfreq=noraman
keyword: PBEPBE/SDD
title: #p freq=noraman PBEPBE/SDD
converged: NO YES NO NO
title: Mulliken charges:
elementType: O O O C C C C C C C C C C C C C C C C C H H H H H H H H H H H H H H H H H H H H H H H H H H H H H H H H H H
charge: -0.247460 -0.310816 -0.286436 -0.042924 -0.011853 -0.480811 -0.031531 -0.091209 -0.407140 -0.317464 -0.729598 -0.731985 -0.244564 -0.226542 -0.079389 -0.081107 -0.694610 -0.702815 -0.702462 -0.691862 0.221134 0.205330 0.246167 0.198252 0.174209 0.223217 0.199274 0.214871 0.177966 0.220067 0.216207 0.205682 0.216011 0.251254 0.208333 0.196670 0.187374 0.176201 0.177295 0.217203 0.209232 0.203968 0.207659 0.194811 0.240237 0.212096 0.218559 0.205874 0.207618 0.210493 0.220036 0.244302 0.200032 0.204947
chargesum: 0.00000
title: Mulliken charges with hydrogens summed into heavy atoms:
elementType: O O O C C C C C C C C C C C C C C C C C
charge: -0.247460 -0.310816 -0.286436 0.178210 0.193477 -0.036393 0.142678 0.132007 0.007004 0.080569 -0.091698 -0.075727 0.119010 0.167956 0.129843 0.122861 -0.051903 -0.066287 -0.064315 -0.042580
polarizability: 2.04127976e+02 1.86394293e+00 1.95429357e+02 -4.60192204e+00 4.24696157e+00 1.85384377e+02
1716.lowfreq: -0.0010 -0.0008 -0.0005 5.2749 6.9046 11.3305 16.4175 21.5617 27.4824
frequency: 16.3249 21.2322 26.6003 40.0071 45.3021 63.2475 74.8155 92.3230 108.6911 125.3279 129.1129 152.2635 164.1894 195.8669 198.8597 206.4945 215.2926 224.8709 233.2653 236.5373 245.1058 249.9321 278.0014 294.6589 304.4381 324.8932 354.3342 359.7549 378.6677 398.4699 400.3344 409.2833 427.7211 433.8877 463.3804 491.5503 493.9534 568.9968 589.1775 662.4893 797.6766 822.9723 827.9563 840.9722 858.0815 865.2410 891.2318 902.0698 906.2670 913.8993 915.7531 920.2741 921.3072 927.2254 938.9374 942.6647 954.3048 964.5933 968.7095 969.2264 972.6881 991.4102 1021.9857 1039.8567 1061.3407 1086.7061 1114.6867 1122.6777 1135.3881 1136.1580 1144.9680 1146.2579 1151.4801 1155.5078 1182.0749 1183.6141 1190.0379 1193.1431 1214.5256 1226.1031 1230.7309 1256.1107 1272.3249 1277.3679 1289.5573 1293.4293 1298.2769 1309.3955 1316.7879 1320.8553 1338.9297 1340.4599 1342.4952 1345.8400 1349.7027 1359.4806 1368.5704 1369.3289 1372.6212 1374.1991 1377.8002 1381.0220 1391.6979 1397.4091 1398.6288 1451.6250 1459.8940 1464.1824 1464.6337 1465.9697 1469.4309 1470.2405 1472.8603 1474.3181 1479.8570 1480.6466 1482.6170 1483.7006 1484.8930 1491.0223 1491.2809 1496.2374 2892.6572 2910.4846 2923.2439 2932.6046 2957.9704 2960.2712 2968.1578 2969.7330 2970.1274 2971.4331 2972.1628 2973.5518 2975.6702 2982.6501 2984.5105 2986.4747 2989.0090 2990.7177 3029.1812 3044.0170 3055.6184 3058.1805 3058.3789 3061.2820 3065.9144 3067.2468 3068.5824 3072.6610 3073.3715 3074.5590 3075.0616 3089.6983 3094.4762 3099.6196
redmass: 2.9461 3.3520 2.9251 3.1660 3.0364 2.7610 3.4501 3.3304 2.7685 3.1943 2.6546 2.6989 2.9142 1.6297 1.1749 1.1486 2.6187 1.2099 1.1827 1.1359 1.5175 3.0397 2.2943 2.9541 2.7587 2.0539 2.3964 2.4873 2.5788 2.3159 2.4104 2.2375 2.3208 4.3527 3.0256 2.7826 3.2367 4.1467 3.1079 3.3412 2.4783 2.4755 2.7238 2.2832 3.2009 1.8161 2.3196 1.7542 1.6720 1.9326 1.5032 1.2484 1.2115 1.5199 1.8554 1.6202 1.4891 1.7599 2.0297 1.8191 2.1823 2.7439 5.7429 1.8545 2.4015 3.6585 2.7740 2.5874 2.1357 2.1773 1.7078 1.8436 1.9422 1.9337 1.7765 1.5948 1.7369 1.7507 1.4783 1.3111 1.3202 1.2394 1.3405 1.1886 1.2678 1.2973 1.3676 1.2484 1.3449 1.2558 1.3922 1.4207 1.4207 1.4275 1.4184 1.2858 1.2893 1.2786 1.2638 1.2546 1.3151 1.3514 1.2160 1.2609 1.2815 1.0912 1.0859 1.0536 1.0548 1.0553 1.0474 1.0530 1.0731 1.0545 1.0498 1.0524 1.0685 1.0638 1.0733 1.0574 1.0578 1.0525 1.0813 1.0548 1.0692 1.0635 1.0990 1.0844 1.0360 1.0377 1.0356 1.0375 1.0670 1.0385 1.0377 1.0823 1.0731 1.0671 1.0812 1.0869 1.0988 1.0988 1.1005 1.0987 1.0989 1.0994 1.0988 1.0984 1.0991 1.0983 1.0991 1.0959 1.0987 1.0989 1.0987 1.0981
irintensity: 0.0073 0.0509 0.0504 0.5851 0.3302 0.3453 0.2532 1.4351 0.6180 1.6130 0.3583 0.5441 6.7981 0.4721 0.3156 0.0616 1.7126 0.5198 0.7438 0.2404 0.3653 2.9419 2.9477 8.9896 0.3156 1.6296 0.8363 0.9574 1.2286 2.4090 0.7416 0.9728 0.4813 2.6306 1.0240 5.6264 1.1791 3.0908 4.2583 8.6669 0.6487 1.3267 0.6605 8.7913 25.4251 32.2573 30.7617 0.1961 17.7493 9.9097 5.4355 3.6032 4.7472 7.3160 22.0933 21.9072 11.4565 5.6727 16.9168 3.4083 8.2313 184.5288 148.3396 47.1764 20.1759 155.3258 28.1078 3.0349 3.9322 4.4447 5.6750 2.8374 5.4885 2.0018 7.0693 4.0055 3.0419 4.2588 5.5851 0.4491 0.2654 5.6476 4.0249 9.5908 6.8552 2.9850 1.0943 3.8138 0.5732 23.4140 2.9315 2.4028 1.7982 1.5751 7.5063 4.1775 19.6849 4.4426 8.2608 15.4183 22.2962 12.2162 38.1150 9.9443 0.7022 10.7166 5.8458 2.8951 5.9669 5.0768 0.4352 1.4997 7.2359 3.3132 10.1364 9.5638 8.4076 9.1152 2.8430 30.5699 20.1038 26.8673 41.2156 47.4291 65.8402 77.5779 41.3297 4.0242 33.8423 35.5501 40.4991 33.7366 8.5895 33.5747 28.4850 9.8034 60.0256 14.3161 39.1420 39.0901 29.2795 30.6502 52.0563 7.8118 18.4685 22.9494 64.4582 92.6670 54.3849 75.1386 59.4226 27.9409 62.2226 34.2289 31.2396 22.5474
temp: 298.150 k
press: 1.00000 atm
elementType: 8 8 8 6 6 6 6 6 6 6 6 6 6 6 6 6 6 6 6 6 1 1 1 1 1 1 1 1 1 1 1 1 1 1 1 1 1 1 1 1 1 1 1 1 1 1 1 1 1 1 1 1 1 1
symmnumber: 1
zpe: 1268492.2 jmol-1
zpe.correction: 0.483143 hartree
zpe.thermalcorrener: 0.508071 hartree
zpe.thermalcorrenthalpy: 0.509015 hartree
zpe.thermalcorrgfe: 0.426774 hartree
zpe.sumelectzpe: -892.180863 hartree
zpe.sumelectthermal: -892.155935 hartree
zpe.sumelectthermalent: -892.154990 hartree
zpe.sumelectthermalfe: -892.237232 hartree
dipole: -0.7928 -0.9776 0.5646
dipole: 1.3795
quadrupole: -126.4346 -118.9418 -127.6375
quadrupole: 2.3552 -4.5706 1.9136
quadrupole: -2.0967 5.3962 -3.2995 2.3552 -4.5706 1.9136
hfenergy: -892.6640057 hartree
pointgroup: C01 [X(C17H34O3)]
dipole: 0.3129749 -0.3846676 -0.2205234 debye
polarizability: 204.497466|-1.71943|195.8797596|-3.6851201|-3.7678173|184.5644848 unknown
InChI: InChI=1S/C17H34O3/c1-12(2)10-19-16(14(5)6)15-8-7-9-18-17(15)20-11-13(3)4/h12-17H,7-11H2,1-6H3
charge 0 multiplicity 1
54 atoms
O  1.627884 -1.553875 1.710575
O  -2.233201 0.165856 -0.692878
O  1.784036 0.254517 0.209205
C  -0.292285 -0.990962 0.254848
C  -0.845957 -0.269114 -1.009964
C  -0.890913 -2.40005 0.496223
C  1.24442 -1.061146 0.361458
C  -0.964578 -1.080123 -2.327687
C  -0.405864 -2.975429 1.847967
C  1.132277 -2.927567 1.926309
C  0.378857 -1.698971 -2.786056
C  -1.52917 -0.172907 -3.448067
C  -2.312959 1.466841 -0.017926
C  3.263408 0.303227 0.1930
C  -3.785632 1.737302 0.3398
C  3.688049 1.770156 0.021185
C  -4.318507 0.688733 1.341931
C  -3.936495 3.175159 0.890187
C  5.21924 1.848319 -0.185885
C  3.235655 2.624674 1.226914
H  -0.588516 -0.355775 1.115781
H  -0.216006 0.628097 -1.196885
H  -1.993247 -2.327769 0.471512
H  -0.591279 -3.089263 -0.319703
H  1.69652 -1.767282 -0.376813
H  -1.693504 -1.896492 -2.148671
H  -0.751614 -4.020104 1.975982
H  -0.825019 -2.378623 2.680814
H  1.577017 -3.610199 1.16577
H  1.50696 -3.213447 2.923235
H  1.174157 -0.930094 -2.831067
H  0.724453 -2.51301 -2.12458
H  0.267495 -2.124048 -3.800624
H  -2.476365 0.291758 -3.12856
H  -1.713329 -0.756287 -4.369414
H  -0.810055 0.632306 -3.697352
H  -1.924363 2.260261 -0.695413
H  -1.692361 1.474315 0.907211
H  3.633348 -0.318163 -0.653238
H  3.651309 -0.116776 1.141267
H  -4.36895 1.652261 -0.599572
H  3.185687 2.154033 -0.890288
H  -5.394229 0.845332 1.544699
H  -3.777316 0.761468 2.305974
H  -4.18084 -0.331492 0.944328
H  -3.602243 3.931295 0.154918
H  -4.991705 3.388414 1.140555
H  -3.339137 3.309448 1.81292
H  5.757327 1.442263 0.692484
H  5.54235 1.278873 -1.077888
H  5.539829 2.897532 -0.318526
H  2.147267 2.532834 1.382137
H  3.742405 2.289688 2.152802
H  3.482585 3.691102 1.070069
