program: Gaussian 09
title: 000221154
version: EM64L-G09RevD.01
frameworkgroup: C1[X(C9H11Cl)]
method: RPBEPBE
basis: SDD
operation: Freq
keyword: #pfreq=noraman
keyword: PBEPBE/SDD
title: #p freq=noraman PBEPBE/SDD
converged: NO NO NO NO
title: Mulliken charges:
elementType: Cl C C C C C C C C C H H H H H H H H H H H
charge: -0.104465 0.271040 0.359680 0.359683 -0.430810 -0.430811 -0.826523 -0.218411 -0.830791 -0.830789 0.233779 0.233779 0.282146 0.282144 0.227880 0.232436 0.228047 0.250751 0.228046 0.250752 0.232436
chargesum: 0.00000
title: Mulliken charges with hydrogens summed into heavy atoms:
elementType: Cl C C C C C C C C C
charge: -0.104465 0.271040 0.359680 0.359683 -0.197031 -0.197032 -0.262232 0.009469 -0.119557 -0.119555
polarizability: 1.31341552e+02 6.42730027e-05 1.16457577e+02 -5.91686776e+00 5.63706271e-05 6.66631431e+01
1716.lowfreq: -11.0502 -6.7822 -0.0022 -0.0017 0.0007 7.0991 56.9583 86.4485 154.7760
frequency: 56.7136 86.4483 154.7740 166.4619 170.2122 221.4064 287.8728 320.0472 343.9840 446.5083 472.9319 508.9927 524.9246 527.3564 615.2904 658.9578 763.8932 783.1169 823.4951 850.3237 901.7097 948.5944 982.6465 990.0064 1036.2064 1046.5568 1046.8597 1093.0692 1142.1705 1179.8445 1209.1440 1243.0757 1264.3447 1265.9247 1373.4842 1398.5448 1398.9617 1434.0246 1455.1721 1467.8239 1473.4599 1474.5021 1485.1953 1495.4371 1595.3442 1605.5651 2971.0902 2971.7809 3051.0844 3051.2882 3085.4507 3087.4164 3088.5948 3119.0326 3128.4463 3154.4189 3164.4408
redmass: 5.3079 4.8140 3.9996 1.0614 1.0528 2.6808 3.2923 3.3736 2.3379 2.4682 4.3375 5.4715 3.0586 4.9647 4.5314 4.5682 4.1244 1.2059 4.6517 2.0813 1.3089 1.6451 1.3442 1.5935 1.5675 1.5911 1.5430 1.7736 1.1774 1.2142 3.8075 1.2479 1.5363 2.6781 5.9229 1.2572 1.2332 1.7839 2.0071 1.4031 1.0748 1.1076 1.1793 1.1110 7.1873 5.8503 1.0391 1.0391 1.0953 1.0953 1.0648 1.0992 1.0910 1.0858 1.0918 1.0994 1.1108
irintensity: 2.0723 0.8473 4.5935 0.0328 1.6573 0.0008 3.9392 2.5467 1.0337 1.0657 3.7151 37.3866 0.0032 1.8045 50.9409 13.5960 0.3284 50.2631 9.4462 0.0893 0.0250 4.5928 0.0639 1.6256 0.1438 18.4314 1.5789 2.8311 1.2581 1.7688 15.8932 32.3686 0.0420 0.3059 5.6442 22.6308 6.2592 15.8851 2.4572 21.1659 1.8821 25.0164 27.1828 2.7599 13.9458 13.8439 40.1778 13.1402 2.6350 30.4965 9.0846 15.5153 28.4488 0.1023 27.1662 31.3832 4.3942
temp: 298.150 k
press: 1.00000 atm
elementType: 17 6 6 6 6 6 6 6 6 6 1 1 1 1 1 1 1 1 1 1 1
symmnumber: 1
zpe: 452573.8 jmol-1
zpe.correction: 0.172376 hartree
zpe.thermalcorrener: 0.182569 hartree
zpe.thermalcorrenthalpy: 0.183513 hartree
zpe.thermalcorrgfe: 0.136391 hartree
zpe.sumelectzpe: -808.885016 hartree
zpe.sumelectthermal: -808.874824 hartree
zpe.sumelectthermalent: -808.873879 hartree
zpe.sumelectthermalfe: -808.921001 hartree
dipole: 1.7899 0.0000 1.6018
dipole: 2.4019
quadrupole: -69.4821 -59.5516 -68.6067
quadrupole: 0.0000 -5.4481 0.0000
quadrupole: -3.6020 6.3286 -2.7266 0.0000 -5.4481 0.0000
hfenergy: -809.0573922 hartree
pointgroup: C01 [X(C9H11Cl1)]
dipole: -0.6477256 -0.0000877 -0.6880948 debye
dipolederiv: -0.7187255 -0.0000701 -0.1429483 -0.0000705 -0.2060851 -0.0000193 -0.4908599 -0.0000668 -0.3883162 -0.260729 -0.0000069 -0.0239453 -0.0000078 -0.2040825 -0.0000009 0.1533366 0.0000232 -0.1666558 0.1259726 0.2187856 -0.0337317 0.0229384 0.2549859 -0.0434411 -0.0431216 -0.0632383 -0.0012506 0.1260423 -0.2188237 -0.0337386 -0.0229755 0.2549198 0.043425 -0.0431328 0.0632159 -0.0012528 -0.1540504 -0.2306396 -0.0118486 -0.1325854 -0.0813329 0.0136415 -0.0006427 0.0497109 -0.1812361 -0.1541518 0.2306194 -0.0118482 0.1325654 -0.081233 -0.013645 -0.0006315 -0.0497109 -0.1812356 0.9295612 0.0001081 0.2492803 0.0001094 0.1414677 0.0000339 0.4329132 0.000059 0.4721945 0.109119 -0.0000005 -0.0668071 -0.0000012 0.1141204 -0.0000107 -0.0500692 -0.0000086 -0.1078528 -0.0243741 -0.1334641 -0.0055242 -0.0846136 -0.0917008 0.0163998 -0.0116763 0.0577007 0.0482958 -0.0244361 0.1334853 -0.0055229 0.0846309 -0.091642 -0.0163979 -0.0116665 -0.0576955 0.0482965 0.0385233 0.0672306 0.0197154 0.1048288 -0.0897133 -0.019926 0.0259586 -0.0203508 0.1498224 0.0385706 -0.0671948 0.0197108 -0.1047929 -0.0897605 0.0199343 0.025954 0.0203614 0.1498218 0.0091133 -0.0248296 -0.0432324 -0.0931778 -0.0061569 0.0943773 -0.0553022 0.0619003 -0.0220315 0.0090792 0.0248332 -0.0432066 0.0931818 -0.0061249 -0.0943897 -0.055286 -0.0619151 -0.0220312 -0.1258156 -0.0000288 0.055996 -0.0000288 0.0827659 0.0000081 0.0572419 0.0000079 0.140602 -0.003458 0.1628367 0.0440647 0.0581889 -0.0505608 -0.0291992 0.0404911 -0.0624906 0.095721 0.0703905 -0.055366 0.0820273 -0.0326748 0.0320769 0.0048536 0.0854633 0.0680633 -0.102765 -0.0287908 -0.0601994 -0.0872667 -0.0105893 0.0682778 0.0234821 -0.0924608 -0.0261659 0.0384585 0.0703626 0.0553779 0.0820324 0.0326858 0.0321016 -0.0048306 0.0854865 -0.0680406 -0.1027617 -0.0288042 0.0601719 -0.0872622 0.0105644 0.0682974 -0.023506 -0.0924693 0.026141 0.0384549 -0.0033989 -0.1628253 0.044056 -0.0581763 -0.0506207 0.0292109 0.0404734 0.0624994 0.0957219 unknown
polarizability: 131.876823|0.0019533|116.4575776|-0.3198227|-0.0005497|66.1278714 unknown
InChI: InChI=1S/C9H11Cl/c1-7-4-3-5-8(2)9(7)6-10/h3-5H,6H2,1-2H3
charge 0 multiplicity 1
21 atoms
Cl 2.987114 0.0004 0.962339
C  0.420307 0.00005 -0.289321
C  -0.271128 1.242071 -0.129646
C  -0.270782 -1.242161 -0.129628
C  -1.656638 1.2218 0.160812
C  -1.656298 -1.22227 0.160826
C  1.879976 0.000251 -0.625063
C  -2.349077 -0.00033 0.300411
C  0.452204 2.574518 -0.252701
C  0.452919 -2.574409 -0.252655
H  -2.19197 2.170881 0.283596
H  -2.191368 -2.171497 0.283621
H  2.209309 0.903406 -1.153525
H  2.209555 -0.902811 -1.153528
H  -3.420821 -0.000478 0.529118
H  -0.214296 3.404508 0.036219
H  0.788731 2.766683 -1.290559
H  1.347194 2.611549 0.395031
H  0.789524 -2.766491 -1.290503
H  1.347904 -2.61119 0.395099
H  -0.213359 -3.404579 0.036257
