program: Gaussian 09
title: 000222147
version: EM64L-G09RevD.01
frameworkgroup: C1[X(C22H23NO6)]
method: RPBEPBE
basis: SDD
operation: Freq
keyword: #p
keyword: freq=noraman
keyword: PBEPBE/SDD
title: #p freq=noraman PBEPBE/SDD
converged: YES YES NO NO
title: Mulliken charges:
elementType: O O O O O O N C C C C C C C C C C C C C C C C C C C C C C H H H H H H H H H H H H H H H H H H H H H H H
charge: -0.288328 -0.264468 -0.224832 -0.231169 -0.245742 -0.205937 -0.493771 0.554729 0.352337 0.100968 -0.565592 0.241534 -0.587110 -0.534460 -0.806633 0.464207 0.093573 0.173265 0.249844 -0.530810 -0.338549 -0.341911 0.263290 -0.258210 -0.223490 -0.239499 -0.225083 -0.751518 -0.657079 0.261934 0.243195 0.215362 0.225214 0.237374 0.243846 0.314395 0.217568 0.245064 0.230172 0.276307 0.204003 0.242020 0.224654 0.235070 0.231156 0.234841 0.256443 0.243962 0.249031 0.214850 0.235176 0.238807
chargesum: 0.00000
title: Mulliken charges with hydrogens summed into heavy atoms:
elementType: O O O O O O N C C C C C C C C C C C C C C C C C C C C C C
charge: -0.288328 -0.264468 -0.224832 -0.231169 -0.245742 -0.205937 -0.179377 0.554729 0.352337 0.100968 -0.303657 0.241534 -0.343915 -0.319098 -0.100199 0.464207 0.093573 0.173265 0.249844 0.161994 -0.062242 -0.137908 0.263290 0.208464 0.011580 -0.008343 0.009758 -0.002081 0.031753
polarizability: 4.99728621e+02 2.57937574e+00 2.74119917e+02 4.56816149e-01 -6.27726152e+00 1.62465616e+02
1716.lowfreq: -5.3108 -0.0006 0.0007 0.0008 1.2935 2.5299 7.2100 15.4774 21.6386
frequency: 6.8921 15.4185 21.6333 30.7229 36.2688 47.7686 51.4031 60.1926 63.0732 67.0994 73.7385 83.9695 93.2933 102.2306 107.2304 139.0151 149.8088 156.1398 163.5109 170.3493 191.4755 204.5273 210.7652 221.4224 244.0903 259.2366 279.6818 288.5193 304.6295 309.1432 333.9187 348.9327 378.8082 398.6710 403.9342 430.1834 453.9155 479.9726 499.7836 518.2778 524.3447 539.5158 552.3012 590.9491 593.0592 608.6860 614.7963 630.7832 637.0386 650.8342 682.2106 683.0476 700.4501 711.6639 757.8815 762.4425 772.3848 790.2063 813.4609 833.1703 845.1263 850.4695 860.0734 865.9742 876.9055 893.5554 910.7768 931.9397 982.5654 983.2507 989.1967 989.4838 1006.9877 1009.1395 1012.3176 1027.3387 1038.5234 1048.6988 1072.7766 1079.6587 1091.5066 1093.5047 1112.8090 1120.9369 1140.3684 1157.7176 1160.7045 1172.3707 1174.8210 1193.3096 1206.6356 1237.2416 1254.6381 1260.6495 1275.3187 1316.4125 1324.8628 1347.5391 1369.4682 1381.6756 1385.6098 1387.9481 1391.6203 1401.1264 1420.6599 1433.4173 1442.0734 1451.5964 1453.8027 1453.8470 1456.8732 1462.1986 1463.2031 1467.0461 1471.4945 1472.5028 1484.0789 1490.2944 1500.6273 1572.9541 1594.9075 1602.8932 1606.5413 1608.2548 1611.8632 1640.6046 1685.4528 2963.2345 2983.9666 2991.5265 3008.5393 3033.8061 3053.3421 3063.7324 3068.9763 3085.8651 3094.7878 3096.2825 3099.2053 3114.4278 3121.3597 3128.1359 3134.2538 3142.4946 3147.2228 3147.3495 3160.3507 3163.1488 3171.9484 3540.8375
redmass: 4.9300 4.0339 5.3191 3.8613 4.8514 3.0163 5.5050 3.8650 2.7011 1.5213 2.4036 2.8167 1.2248 4.3731 5.5649 6.0831 5.8216 4.4391 5.7949 4.3587 5.4160 1.5644 1.8997 3.6289 1.8396 2.4971 3.8664 3.6978 4.2699 4.4625 3.5981 4.2086 4.8205 3.1734 4.0714 4.3276 5.0502 4.8348 5.2948 4.7727 5.0744 3.4191 3.6396 2.5913 3.1820 2.9500 5.9002 3.7039 3.0087 6.9635 5.4787 5.2517 1.5283 3.8785 2.4709 5.8983 3.6148 2.3631 1.6512 1.8012 3.2803 1.3078 4.8052 1.7458 4.1627 1.6965 4.7438 1.4341 2.5949 1.4138 5.5357 2.0478 1.3469 2.7904 2.5548 2.3670 1.6453 1.5424 2.6208 3.7946 1.9152 2.1051 1.2629 4.7614 3.9405 1.7198 1.5492 2.9950 1.0596 1.1206 1.6359 2.9842 1.9151 1.5531 1.1184 1.9034 2.2336 1.4408 2.8615 1.2423 8.8814 1.2547 3.3043 1.4281 2.3783 2.1095 1.4106 1.6075 1.0548 1.0881 1.1112 1.0485 1.0477 1.0515 1.6551 1.1515 1.0548 1.8139 2.0328 6.2210 6.9458 6.8666 6.6567 7.4116 6.6025 7.9813 10.3986 1.0330 1.0376 1.0362 1.0369 1.0597 1.1038 1.0963 1.0880 1.0970 1.1026 1.1001 1.0964 1.0877 1.1067 1.0997 1.0868 1.1017 1.0919 1.0907 1.0957 1.0919 1.1006 1.0763
irintensity: 1.1210 1.3695 0.2173 1.7224 1.9405 0.2009 0.6658 2.6535 1.1445 2.0317 3.0574 7.4104 0.1096 0.4037 3.5651 2.5684 2.1943 2.4572 0.4816 3.8562 2.1514 1.2707 3.2781 0.5001 2.5321 1.9528 5.7259 10.2151 2.6709 16.4183 3.7872 2.1159 4.5249 1.3633 0.9612 2.3567 13.8685 1.9663 20.1038 18.0400 2.1163 3.1691 11.5147 10.1329 10.5675 37.8630 5.6271 12.4026 7.2685 3.0649 4.4669 19.2748 104.7328 10.0353 8.9578 34.3053 13.0693 25.7273 1.8977 6.9307 6.0626 6.2211 42.6191 23.5531 30.7243 43.0150 19.6130 3.5827 7.9939 2.5096 0.1850 130.1672 1.9315 41.5125 36.8539 7.3527 9.9045 5.3868 69.4559 93.8614 20.6653 17.7848 0.3068 106.2096 421.6053 42.1235 80.4620 358.2489 0.4974 12.2104 27.7906 43.3247 144.4287 12.4739 3.8455 78.0866 130.0077 51.9708 212.0206 76.5193 5.4113 18.4809 41.6447 17.9622 16.5963 15.0684 49.1973 92.6352 24.3114 25.5202 21.6532 24.8944 6.8703 15.5235 213.3384 23.3053 18.3705 239.3298 32.2740 90.4942 46.5558 34.7996 76.4542 120.1081 46.9926 30.7555 162.1162 58.9131 22.2040 17.7356 2.5761 22.8714 39.7795 15.4851 38.6246 45.5421 0.7406 16.9231 7.1250 17.8127 27.2158 26.0016 0.7794 12.2696 19.4391 9.6211 15.5476 0.9555 26.4742 12.3468
temp: 298.150 k
press: 1.00000 atm
elementType: 8 8 8 8 8 8 7 6 6 6 6 6 6 6 6 6 6 6 6 6 6 6 6 6 6 6 6 6 6 1 1 1 1 1 1 1 1 1 1 1 1 1 1 1 1 1 1 1 1 1 1 1
symmnumber: 1
zpe: 1061353.3 jmol-1
zpe.correction: 0.404248 hartree
zpe.thermalcorrener: 0.434295 hartree
zpe.thermalcorrenthalpy: 0.435239 hartree
zpe.thermalcorrgfe: 0.337718 hartree
zpe.sumelectzpe: -1356.119641 hartree
zpe.sumelectthermal: -1356.089594 hartree
zpe.sumelectthermalent: -1356.088650 hartree
zpe.sumelectthermalfe: -1356.186171 hartree
dipole: 0.7132 -4.6190 -0.5061
dipole: 4.7011
quadrupole: -135.8043 -141.8628 -180.7151
quadrupole: -12.5300 3.6400 0.1847
quadrupole: 16.9898 10.9312 -27.9210 -12.5300 3.6400 0.1847
hfenergy: -1356.5238889 hartree
pointgroup: C01 [X(C22H23N1O6)]
dipole: 0.3416709 0.9534118 -1.5476212 debye
polarizability: 498.0447985|12.7594602|177.6921263|18.3344983|-37.6597325|260.5772294 unknown
InChI: InChI=1S/C22H23NO6/c1-5-28-22(26)18(23-21(25)17-9-7-6-8-10-17)12-16-11-14(2)20(29-15(3)24)19(13-16)27-4/h6-13,23H,5H2,1-4H3
charge 0 multiplicity 1
52 atoms
O  -5.343387 0.448656 -0.254194
O  -4.236873 0.474205 -2.745151
O  0.703527 -1.864652 1.160941
O  1.227347 0.012689 2.456649
O  3.680115 -1.149342 1.129233
O  -5.59534 -1.743379 -1.062213
N  2.702167 0.401976 -0.305488
C  -1.108681 0.488722 -0.630873
C  -3.134399 0.434937 0.788167
C  -3.923818 0.409954 -0.381192
C  -1.727788 0.483229 0.648442
C  -3.337404 0.454514 -1.674733
C  -1.93387 0.49555 -1.792192
C  0.348694 0.537913 -0.829046
C  -3.793955 0.41273 2.152933
C  1.34957 0.118751 0.010496
C  1.118457 -0.55992 1.346628
C  3.812335 -0.242126 0.251849
C  5.159715 0.22045 -0.230573
C  -3.679313 0.398309 -4.097122
C  6.277708 -0.090243 0.586246
C  5.367869 0.910484 -1.455026
C  -6.104443 -0.665761 -0.711749
C  0.534131 -2.689152 2.400078
C  7.575619 0.300869 0.20018
C  6.668815 1.297863 -1.842962
C  7.775131 0.999979 -1.013894
C  -7.570833 -0.304836 -0.685947
C  -0.864296 -2.515293 2.998746
H  -1.11697 0.54985 1.552795
H  -1.462219 0.512542 -2.779974
H  0.669236 0.967191 -1.79174
H  -3.045458 0.541252 2.952347
H  -4.318603 -0.546146 2.32409
H  -4.550635 1.211787 2.246442
H  2.867313 1.147275 -0.98431
H  -3.056764 1.285475 -4.325452
H  -4.551732 0.37643 -4.766143
H  -3.082228 -0.523953 -4.229965
H  6.099988 -0.641909 1.514934
H  4.535428 1.119413 -2.1389
H  1.325887 -2.400541 3.112954
H  0.704548 -3.715794 2.03943
H  8.430397 0.06173 0.84186
H  6.820612 1.821651 -2.79292
H  8.783754 1.302543 -1.316061
H  -7.785486 0.395199 -1.513155
H  -8.181416 -1.210978 -0.809077
H  -7.828056 0.207654 0.255568
H  -1.000607 -3.234841 3.827764
H  -1.643664 -2.70792 2.241443
H  -0.998325 -1.49728 3.400738
