program: Gaussian 09
title: 000221149
version: EM64L-G09RevD.01
frameworkgroup: C1[X(C12H14ClNO3)]
method: RPBEPBE
basis: SDD
operation: Freq
keyword: #p
keyword: freq=noraman
keyword: PBEPBE/SDD
title: #p freq=noraman PBEPBE/SDD
converged: YES YES NO NO
title: Mulliken charges:
elementType: Cl O O O N C C C C C C C C C C C C H H H H H H H H H H H H H H
charge: -0.052424 -0.258734 -0.232147 -0.270451 -0.634248 0.041064 0.374073 0.358721 0.368996 -0.583002 -0.612730 -0.811238 -0.812566 0.120225 0.132221 -0.181483 -0.590281 0.220763 0.285285 0.229860 0.272018 0.218775 0.266439 0.233101 0.225138 0.237187 0.255685 0.261867 0.278056 0.322513 0.337316
chargesum: 0.00000
title: Mulliken charges with hydrogens summed into heavy atoms:
elementType: Cl O O O N C C C C C C C C C C C C
charge: -0.052424 -0.258734 -0.232147 -0.270451 0.025581 0.041064 0.374073 0.358721 0.368996 -0.362239 -0.327444 -0.090585 -0.087888 0.120225 0.132221 0.311389 -0.050359
polarizability: 2.15119261e+02 -8.79168199e+00 1.76040477e+02 -8.83083511e+00 -7.59110148e+00 8.93211354e+01
1716.lowfreq: -13.6664 -4.2134 -3.0613 -0.0022 0.0007 0.0014 16.4471 38.8697 40.9832
frequency: 15.7309 38.8431 40.7874 47.4961 56.6329 111.9630 126.5887 129.8302 140.9851 158.0900 173.4483 223.9116 244.6320 251.7772 263.4692 280.2830 303.8706 380.4606 389.4869 428.6734 441.7010 481.3908 507.8345 526.0889 541.9641 552.4235 573.4053 606.4377 611.6908 616.3570 698.9352 739.2065 767.7896 784.6769 824.3886 885.0516 917.8008 935.4408 936.8736 955.1849 981.0487 1007.2162 1029.5497 1044.7969 1048.3261 1053.1180 1055.6458 1081.0756 1133.8014 1170.1044 1218.8368 1224.0757 1255.0758 1268.6764 1298.3125 1358.9427 1363.4333 1364.0929 1401.5169 1405.3834 1415.9506 1436.5406 1437.3738 1451.8240 1463.6891 1465.5331 1479.0318 1488.8834 1561.6617 1588.1135 1612.1637 1617.0510 1634.8037 2990.8440 2991.7480 2996.6962 3063.3024 3072.8520 3075.4162 3076.8755 3094.9711 3100.6714 3122.0298 3148.3526 3154.7100 3528.1517 3681.1431
redmass: 5.8787 5.4001 5.2675 5.6971 8.6977 4.3703 2.7611 1.5323 1.6600 1.5578 3.9839 2.8540 4.2020 4.0928 4.4443 3.7075 2.7469 3.5785 4.9016 3.3863 4.2002 1.2743 3.2370 2.7736 3.4718 3.6477 3.6043 3.8860 1.8581 3.6070 4.8249 4.8361 3.4058 4.5338 3.7882 1.4888 5.7447 1.6037 1.9213 3.0876 1.8135 1.5551 4.1958 1.6535 1.7092 1.7236 1.7729 2.5176 1.8046 1.1665 1.3498 2.6019 1.5146 3.1762 1.1988 1.8965 6.3932 2.9729 1.6058 1.2149 2.0937 1.3587 1.5215 1.1068 1.0623 1.0552 1.1285 1.3158 5.5582 2.3918 6.8626 7.0560 2.2404 1.0378 1.0375 1.0609 1.0654 1.0957 1.0942 1.0972 1.0993 1.1005 1.0908 1.1100 1.0920 1.0448 1.1040
irintensity: 3.7820 6.3716 0.3165 7.2158 3.6126 0.3559 6.2066 2.6259 0.7042 3.5191 4.1142 0.4879 4.4485 0.6940 9.5383 3.6887 2.6593 10.2658 1.3741 16.6923 3.0367 87.6970 35.6476 14.7067 28.3196 0.7215 33.4073 21.2388 74.9331 21.4912 4.4404 35.1468 13.5965 1.6445 1.2899 10.8621 8.0954 13.0834 11.9017 5.9020 8.0033 1.0515 265.7794 6.3879 4.6744 15.1019 13.0410 59.6090 55.9701 0.6471 32.9812 203.2973 30.2028 43.4415 21.3754 69.1418 30.8876 107.8164 30.6657 20.8944 0.4770 53.8365 25.2195 12.6839 29.2781 7.7730 28.9032 4.4556 139.8730 53.6759 66.9308 221.2486 162.2602 24.8478 11.3058 19.0701 12.4852 12.9792 17.8872 17.4516 9.6227 16.1673 19.1194 8.5998 1.1380 39.9491 31.2797
temp: 298.150 k
press: 1.00000 atm
elementType: 17 8 8 8 7 6 6 6 6 6 6 6 6 6 6 6 6 1 1 1 1 1 1 1 1 1 1 1 1 1 1
symmnumber: 1
zpe: 629385.4 jmol-1
zpe.correction: 0.239720 hartree
zpe.thermalcorrener: 0.257687 hartree
zpe.thermalcorrenthalpy: 0.258631 hartree
zpe.thermalcorrgfe: 0.191166 hartree
zpe.sumelectzpe: -1204.930196 hartree
zpe.sumelectthermal: -1204.912229 hartree
zpe.sumelectthermalent: -1204.911285 hartree
zpe.sumelectthermalfe: -1204.978750 hartree
dipole: -3.0829 -2.1410 -1.8601
dipole: 4.1891
quadrupole: -114.6259 -98.3222 -107.8040
quadrupole: -21.7202 3.1955 -4.6131
quadrupole: -7.7085 8.5952 -0.8866 -21.7202 3.1955 -4.6131
hfenergy: -1205.1699164 hartree
pointgroup: C01 [X(C12H14Cl1N1O3)]
dipole: 1.0828443 0.9580101 -0.7911523 debye
polarizability: 216.5616186|-1.8737605|175.1567744|9.9391679|2.0507574|88.7624802 unknown
InChI: InChI=1S/C12H14ClNO3/c1-7-5-9(11(14)15)6-8(2)10(7)12(16)17-4-3-13/h5-6H,3-4,14H2,1-2H3
charge 0 multiplicity 1
31 atoms
Cl 4.533216 2.573191 -0.235299
O  2.518814 0.053309 -0.169069
O  2.138902 -1.761172 1.229472
O  -4.832529 -0.682138 -0.213141
N  -4.412819 1.572698 -0.530939
C  0.230216 -0.486049 0.34322
C  -0.241317 0.858199 0.473616
C  -0.673062 -1.561743 0.063465
C  -2.523348 0.062966 -0.036177
C  -1.621041 1.105425 0.283493
C  -2.038409 -1.260536 -0.130181
C  0.664827 2.018953 0.849607
C  -0.21126 -3.004169 -0.046882
C  1.676935 -0.815158 0.54628
C  -4.001486 0.276607 -0.259065
C  3.973678 -0.182632 0.003119
C  4.70536 0.807719 -0.879835
H  -1.980236 2.13098 0.43178
H  -2.758151 -2.05566 -0.350236
H  1.271882 1.793166 1.745044
H  1.379523 2.255413 0.043674
H  0.066797 2.920363 1.066783
H  0.164419 -3.374877 0.922346
H  -1.041539 -3.649935 -0.376219
H  0.620487 -3.118794 -0.76634
H  4.209552 -1.218266 -0.312841
H  4.243884 -0.079383 1.068665
H  5.786651 0.603039 -0.884924
H  4.303696 0.822436 -1.903144
H  -3.762401 2.34183 -0.673759
H  -5.409339 1.733023 -0.673111
