program: Gaussian 09
title: 000222110
version: EM64L-G09RevD.01
frameworkgroup: C1[X(C15H14BrNO2)]
method: RPBEPBE
basis: SDD
operation: Freq
keyword: #p
keyword: freq=noraman
keyword: PBEPBE/SDD
title: #p freq=noraman PBEPBE/SDD
converged: YES YES NO NO
title: Mulliken charges:
elementType: Br O O N C C C C C C C C C C C C C C C H H H H H H H H H H H H H H
charge: -0.010106 -0.412271 -0.389522 -0.137465 0.253922 0.093457 -0.012428 0.331923 -0.312394 -0.238774 0.244293 -0.296556 -0.397716 -0.354192 -0.621033 -0.654490 -0.240886 -0.240179 -0.240184 0.270892 0.270878 0.238143 0.275921 0.236173 0.285011 0.228430 0.276293 0.242513 0.238406 0.224978 0.225689 0.228530 0.392744
chargesum: 0.00000
title: Mulliken charges with hydrogens summed into heavy atoms:
elementType: Br O O N C C C C C C C C C C C C C C C
charge: -0.010106 -0.019527 -0.389522 -0.137465 0.253922 0.093457 -0.012428 0.331923 -0.041503 0.032104 0.244293 -0.296556 -0.159572 -0.078271 0.128581 0.102721 -0.015908 -0.014490 -0.011653
polarizability: 3.03090366e+02 -7.34823701e+00 2.21262515e+02 8.33816973e-01 1.74544051e+01 1.00322620e+02
1716.lowfreq: -5.3020 -0.0006 -0.0005 -0.0005 3.1142 7.2089 36.1710 49.1948 64.1223
frequency: 36.1689 49.1596 64.1211 80.2323 88.9427 100.7909 110.2690 123.3655 159.1133 200.6757 222.0014 244.9140 254.4038 271.0915 297.9622 325.0629 353.6820 362.7991 372.7561 405.3995 434.4199 459.2092 472.5390 530.7582 569.4563 604.8985 615.3033 622.1161 636.1834 692.8089 699.6448 709.9079 761.7131 779.0506 783.8631 822.5554 847.6545 881.7550 900.6178 923.5592 931.2226 971.4560 974.1958 988.8712 994.5893 1025.7480 1055.5837 1056.7480 1087.3007 1095.6379 1110.0011 1136.0436 1142.8278 1173.9636 1199.7774 1216.5439 1242.7997 1254.3754 1286.5167 1317.5671 1335.9035 1361.0350 1370.7272 1385.8275 1409.0172 1420.1991 1424.8074 1443.6090 1452.0394 1468.3831 1480.4250 1488.9557 1489.6209 1502.0900 1554.2136 1571.2370 1584.4213 1611.5548 1618.7512 2630.6336 2972.1827 2979.2882 3050.7602 3060.8206 3119.3368 3121.5347 3130.5721 3136.5733 3143.9259 3161.0409 3166.5099 3186.5728 3193.4383
redmass: 4.4789 3.8317 3.9515 5.6367 5.0852 3.3273 1.8091 3.0560 4.5334 4.2300 1.9593 6.9280 4.0725 2.2594 3.1690 4.9908 4.1084 5.3588 5.4619 2.8581 3.8720 4.0454 5.3163 4.0981 3.9146 6.3878 6.4373 6.6028 6.0388 6.8179 1.7415 6.6130 2.8584 6.1696 3.3164 6.4528 1.2511 1.4419 1.3739 1.6614 3.1227 1.0898 1.3700 4.3824 1.4207 2.8845 1.5111 2.2143 1.6639 1.2342 2.0149 1.5170 2.0091 1.0535 1.1424 2.9206 2.3446 3.8119 2.5356 1.4884 2.9578 5.6262 3.6224 3.8472 1.8785 2.2149 1.3711 2.3503 1.2310 1.1580 1.0709 1.3003 1.6288 1.3988 3.9195 5.4272 5.6620 5.8401 2.8939 1.0727 1.0375 1.0381 1.1001 1.0997 1.0985 1.0850 1.0884 1.0982 1.0941 1.0999 1.0919 1.0916 1.0947
irintensity: 3.6509 0.4254 0.7169 0.2136 2.7584 0.7525 0.4682 0.2883 0.7316 0.4633 1.2154 0.9326 3.5003 3.0206 0.9128 0.4258 2.9394 3.4746 3.3142 0.4342 12.3602 27.6454 5.2353 2.6020 11.5488 10.8713 10.1064 22.1475 38.8420 9.3272 52.5409 39.2879 9.9432 2.7009 40.3942 12.9819 1.3253 25.3221 6.5132 5.0350 12.4178 127.4232 7.1493 1.0141 1.3641 1.2256 14.3797 51.0682 6.0100 1.7464 7.6942 9.3548 127.2217 0.0848 9.7582 5.2116 85.4291 27.0687 19.9658 19.8998 162.1090 74.6702 19.1940 46.4145 77.0653 223.5361 84.6544 55.9261 48.0930 22.9976 24.8424 13.9839 7.8618 63.2218 190.0664 13.5612 3.8236 2.6452 23.5850 733.8170 30.9681 85.7819 35.7528 22.8687 13.6033 4.6695 4.5499 1.5793 35.0240 34.5907 3.1639 0.3511 4.8889
temp: 298.150 k
press: 1.00000 atm
elementType: 35 8 8 7 6 6 6 6 6 6 6 6 6 6 6 6 6 6 6 1 1 1 1 1 1 1 1 1 1 1 1 1 1
symmnumber: 1
zpe: 664876.7 jmol-1
zpe.correction: 0.253238 hartree
zpe.thermalcorrener: 0.270829 hartree
zpe.thermalcorrenthalpy: 0.271773 hartree
zpe.thermalcorrgfe: 0.206289 hartree
zpe.sumelectzpe: -797.316623 hartree
zpe.sumelectthermal: -797.299032 hartree
zpe.sumelectthermalent: -797.298088 hartree
zpe.sumelectthermalfe: -797.363571 hartree
dipole: -3.7087 0.0521 1.5535
dipole: 4.0212
quadrupole: -90.0294 -128.4418 -121.6995
quadrupole: 8.0143 -4.1566 1.8571
quadrupole: 23.3608 -15.0515 -8.3092 8.0143 -4.1566 1.8571
hfenergy: -797.5698607 hartree
pointgroup: C01 [X(C15H14Br1N1O2)]
dipole: 1.3919598 -0.1272601 -0.7410859 debye
polarizability: 299.1660187|8.9193259|187.0246207|-18.3705574|-59.6387413|138.4848619 unknown
InChI: InChI=1S/C15H14BrNO2/c1-17(2)15(19)13-9-11(16)8-12(14(13)18)10-6-4-3-5-7-10/h3-9,18H,1-2H3
charge 0 multiplicity 1
33 atoms
Br 0.881474 3.755124 -1.802257
O  -0.131112 -1.686733 0.878563
O  2.327236 -1.963874 1.130819
N  3.799169 -1.002123 -0.367917
C  -1.019655 0.282729 -0.214869
C  1.447713 -0.119896 -0.143003
C  0.099813 -0.523533 0.185189
C  -2.438325 -0.129386 0.001079
C  -0.75007 1.530883 -0.828248
C  1.669828 1.162712 -0.716074
C  2.551998 -1.054403 0.223221
C  0.572436 1.965513 -1.045929
C  -3.425239 0.22976 -0.961267
C  -2.857583 -0.846704 1.156344
C  4.873875 -1.845919 0.197479
C  4.116761 -0.375335 -1.666323
C  -4.782932 -0.102302 -0.772602
C  -4.21752 -1.172566 1.346328
C  -5.187953 -0.8029 0.387072
H  -1.585964 2.186981 -1.085832
H  2.683235 1.541748 -0.85779
H  -3.123389 0.744789 -1.880911
H  -2.114888 -1.150048 1.896452
H  5.019073 -2.760476 -0.409511
H  4.598897 -2.147553 1.217645
H  5.817544 -1.271639 0.211827
H  3.201614 -0.172017 -2.240909
H  4.739335 -1.078655 -2.249281
H  4.686824 0.565926 -1.5463
H  -5.520846 0.176331 -1.533265
H  -4.518443 -1.719655 2.246861
H  -6.241815 -1.063387 0.536151
H  0.806412 -2.040691 1.179754
