program: Gaussian 09
title: 000222105
version: EM64L-G09RevD.01
frameworkgroup: C1[X(C13H16BrNO2)]
method: RPBEPBE
basis: SDD
operation: Freq
keyword: #p
keyword: freq=noraman
keyword: PBEPBE/SDD
title: #p freq=noraman PBEPBE/SDD
converged: YES YES NO NO
title: Mulliken charges:
elementType: Br O O N C C C C C C C C C C C C C H H H H H H H H H H H H H H H H
charge: -0.001921 -0.477500 -0.284985 -0.640276 -0.180747 -0.427758 -0.431243 -0.402243 -0.402637 -0.385138 0.482701 -0.034524 -0.325658 0.145557 -0.275553 -0.309765 0.131875 0.126544 0.222502 0.208576 0.205668 0.223192 0.191764 0.210989 0.210794 0.191943 0.195284 0.206634 0.254984 0.304900 0.358023 0.380650 0.327365
chargesum: 0.00000
title: Mulliken charges with hydrogens summed into heavy atoms:
elementType: Br O O N C C C C C C C C C C C C C
charge: -0.001921 -0.119477 -0.284985 0.067739 -0.054203 0.003320 -0.002382 0.000511 0.000100 0.016780 0.482701 -0.034524 -0.070674 0.145557 -0.275553 -0.004865 0.131875
polarizability: 2.13482065e+02 -2.46674447e+00 2.00886861e+02 6.18055843e-01 -2.09352143e-02 9.87860850e+01
1716.lowfreq: -17.5106 -5.1685 -0.0006 -0.0005 0.0007 10.0259 11.4970 54.3563 66.8988
frequency: -7.6327 54.3228 66.8682 69.1345 98.5879 128.5303 147.5919 172.7126 224.0475 227.9523 263.1956 272.5076 306.4477 355.9565 363.5043 380.2144 381.3952 388.1748 429.1716 448.8274 482.6839 496.6108 566.7998 580.5215 586.9414 612.3610 618.5642 692.2814 715.4707 726.7537 773.8161 781.9279 783.3119 828.1138 839.4156 874.2178 878.5662 894.3767 918.9226 919.7159 954.6579 998.1955 1048.8184 1049.3998 1070.1603 1085.6657 1096.9199 1110.4871 1131.2316 1142.5195 1167.8405 1183.0643 1234.8484 1240.0136 1250.5158 1251.8989 1273.3168 1289.4818 1305.4227 1321.1639 1336.1966 1341.6610 1341.9078 1351.1741 1360.3821 1395.5954 1416.6473 1431.4743 1459.1133 1461.8849 1464.0169 1470.0850 1476.9593 1565.1967 1590.8950 1600.6953 1624.0877 2875.2019 2964.9861 2966.1395 2972.3029 2977.6086 2981.5985 3030.6895 3033.7988 3037.9134 3041.3577 3049.6550 3156.5222 3165.9902 3461.7729 3550.1853 3647.8548
redmass: 3.3618 5.8700 4.9386 4.6559 6.5134 7.3786 5.3710 3.2974 1.8514 5.8471 3.9875 8.3010 2.6784 2.2462 5.2608 5.2226 1.2258 4.8758 3.0138 3.1612 1.6528 3.2217 4.3628 4.0252 3.7510 1.4225 4.3987 1.2043 3.5915 4.8127 6.0243 1.8095 1.9268 7.0196 2.4317 1.7521 1.5647 1.3688 2.8110 2.2148 1.3774 2.3921 1.2988 1.8114 1.3215 1.9843 2.3229 2.4576 2.1055 1.6624 3.3710 1.4392 1.4029 2.2188 1.3255 1.3428 1.4829 1.1995 1.4433 1.3432 1.3654 2.2654 1.4876 1.5771 2.3903 2.6109 4.4501 3.1654 1.0894 1.0911 1.0882 1.0828 1.0980 3.5632 2.1933 4.4539 3.6660 1.0798 1.0642 1.0653 1.0615 1.0609 1.0616 1.0963 1.0945 1.1010 1.1032 1.1036 1.0917 1.0923 1.0490 1.0651 1.1017
irintensity: 0.3020 4.3603 1.9938 1.2913 0.5463 2.9431 0.6508 1.5526 0.0291 0.5242 0.1392 6.3101 8.4273 1.3313 6.1508 11.5013 80.8077 7.3951 0.9147 2.4785 0.0662 0.4449 14.9399 45.1962 1.5528 161.0613 30.1049 138.2645 0.1298 15.2431 14.9446 0.9512 1.3309 7.5021 8.0601 9.5058 25.0021 0.7685 14.7105 3.7125 13.6659 29.6673 0.1171 0.6593 0.0892 11.4436 1.3570 0.0014 3.5750 45.1933 92.2752 1.0000 3.8268 0.9533 41.6366 19.8014 15.6238 0.9463 4.6439 0.0500 0.2901 100.1009 0.4664 18.3773 90.7224 8.6992 118.8637 76.6714 5.8405 8.3268 9.0104 23.1475 3.7582 145.0562 84.2599 76.2643 221.4059 55.9062 27.0077 43.2378 32.5927 16.1197 25.8149 77.3154 68.7739 4.4144 5.8250 102.5862 3.7744 11.6979 68.9098 60.9576 88.9468
temp: 298.150 k
press: 1.00000 atm
elementType: 35 8 8 7 6 6 6 6 6 6 6 6 6 6 6 6 6 1 1 1 1 1 1 1 1 1 1 1 1 1 1 1 1
symmnumber: 1
zpe: 700758.6 jmol-1
zpe.correction: 0.266905 hartree
zpe.thermalcorrener: 0.282245 hartree
zpe.thermalcorrenthalpy: 0.283189 hartree
zpe.thermalcorrgfe: 0.223750 hartree
zpe.sumelectzpe: -722.402598 hartree
zpe.sumelectthermal: -722.387257 hartree
zpe.sumelectthermalent: -722.386313 hartree
zpe.sumelectthermalfe: -722.445753 hartree
dipole: -7.6724 1.7325 -0.0481
dipole: 7.8657
quadrupole: -120.7793 -100.4567 -112.8249
quadrupole: -5.4663 0.0052 -0.1361
quadrupole: -9.4257 10.8969 -1.4712 -5.4663 0.0052 -0.1361
hfenergy: -722.6695024 hartree
pointgroup: C01 [X(C13H16Br1N1O2)]
dipole: 2.6230801 1.6354817 0.145428 debye
polarizability: 210.524513|6.0814033|202.3493797|-1.5251977|12.2675168|100.281118 unknown
InChI: InChI=1S/C13H16BrNO2/c14-9-6-10(8-4-2-1-3-5-8)12(16)11(7-9)13(15)17/h6-8,16H,1-5,15H2
charge 0 multiplicity 1
33 atoms
Br -1.370805 -4.107605 -0.341824
O  -0.81631 1.997209 0.409803
O  -4.642893 0.14922 0.24062
N  -3.479249 2.141202 0.467086
C  1.672222 0.382918 0.159851
C  2.402903 0.210192 -1.205107
C  2.530149 -0.204673 1.318936
C  3.822111 0.823869 -1.172561
C  3.948121 0.413261 1.344544
C  4.665907 0.239156 -0.014881
C  0.259304 -0.204663 0.12457
C  -0.914083 0.59595 0.241793
C  0.097004 -1.600235 -0.049026
C  -2.218577 0.027077 0.191135
C  -1.189872 -2.166177 -0.099249
C  -2.338952 -1.373809 0.018427
C  -3.536626 0.77446 0.301357
H  1.637089 1.484362 0.346747
H  1.798756 0.664727 -2.013518
H  2.475629 -0.87193 -1.434609
H  2.612862 -1.302036 1.185882
H  2.014773 -0.041409 2.28473
H  3.745274 1.924644 -1.049253
H  4.326294 0.648745 -2.142174
H  4.541931 -0.050091 2.155399
H  3.874202 1.495132 1.583049
H  4.840514 -0.840904 -0.199606
H  5.660732 0.723313 0.014102
H  0.979055 -2.240312 -0.146199
H  -3.352753 -1.78382 -0.017532
H  0.13151 2.280662 0.433932
H  -2.577881 2.622978 0.512464
H  -4.363039 2.643087 0.540611
