program: Gaussian 09
title: 000222089
version: EM64L-G09RevD.01
frameworkgroup: C1[X(C9H16O3)]
method: RPBEPBE
basis: SDD
operation: Freq
keyword: #pfreq=noraman
keyword: PBEPBE/SDD
title: #p freq=noraman PBEPBE/SDD
converged: YES YES NO NO
title: Mulliken charges:
elementType: O O O C C C C C C C C C H H H H H H H H H H H H H H H H
charge: -0.453554 -0.301707 -0.224379 0.180134 -0.464841 -0.462563 -0.414282 -0.393925 -0.384581 0.209864 -0.259937 -0.659287 0.222306 0.222526 0.213743 0.223060 0.196080 0.246333 0.210366 0.199318 0.204893 0.186054 0.348399 0.235475 0.224090 0.218269 0.226885 0.251261
chargesum: 0.00000
title: Mulliken charges with hydrogens summed into heavy atoms:
elementType: O O O C C C C C C C C C
charge: -0.105155 -0.301707 -0.224379 0.180134 -0.020009 -0.025761 0.028131 0.015759 0.006366 0.209864 0.199627 0.037129
polarizability: 1.22315587e+02 -2.83469537e+00 9.45038782e+01 -3.85852790e+00 2.21365535e+00 9.34750957e+01
1716.lowfreq: -17.0949 -8.1521 -0.0004 -0.0001 0.0004 11.4358 26.8320 55.0890 74.6629
frequency: 26.5529 55.0451 74.6099 114.3006 141.4715 197.6470 234.5696 241.8268 282.9809 318.4111 321.8680 353.8830 382.0850 407.8267 421.8267 442.7278 481.8563 544.0033 566.6359 717.1565 729.5189 780.0828 788.9149 816.0913 835.6311 849.3511 906.7799 910.8532 935.0519 947.6058 1010.9093 1033.8209 1047.6417 1069.2137 1086.6921 1096.6184 1102.3918 1141.1498 1151.1476 1161.8804 1174.5865 1253.7615 1256.7413 1274.6719 1279.3706 1312.7214 1328.2355 1337.5774 1339.6855 1345.4433 1355.0506 1373.9961 1392.6491 1456.8998 1457.7405 1462.6679 1464.0679 1465.5271 1473.1076 1478.6537 1483.8631 1641.5900 2966.3517 2976.7116 2985.9847 2993.1896 2993.7120 3000.3547 3029.8952 3031.8402 3036.4379 3050.4159 3054.7393 3069.7587 3088.9831 3093.5141 3119.4975 3532.2700
redmass: 4.3055 3.4300 3.6652 3.5205 2.6503 1.7470 1.6991 2.1466 2.7366 2.8983 3.1902 2.0975 3.0447 1.4281 2.8496 3.3187 2.4387 2.5076 3.1579 6.3326 3.3327 1.4907 2.3771 1.4298 2.7688 1.7820 2.3018 2.1143 1.4001 2.8598 2.7288 3.9029 1.8830 1.5300 2.1564 1.8398 2.3615 1.8341 1.6418 1.6593 1.7240 1.3097 1.3198 1.3265 1.2111 1.3989 1.3971 1.5169 1.4053 1.4659 1.2722 1.6913 1.2298 1.0809 1.0928 1.0889 1.0456 1.0861 1.0814 1.0939 1.0520 10.0301 1.0632 1.0614 1.0611 1.0615 1.0362 1.0635 1.0598 1.0954 1.1007 1.1034 1.1003 1.1021 1.0976 1.1033 1.1059 1.0649
irintensity: 1.9144 1.4895 0.9227 0.4948 0.4986 1.1666 1.9904 0.3345 4.6031 2.3332 16.5517 1.2158 43.9479 128.2503 8.3159 3.7565 2.8673 4.8774 12.8440 6.0348 11.2834 0.4516 4.6987 1.2453 1.8007 15.6126 10.4964 39.7827 6.5816 25.5248 36.2964 88.4510 14.6347 21.8377 208.0546 7.7642 66.1254 5.8616 44.4024 19.6107 20.6222 8.3301 5.5855 4.1066 1.2987 1.7780 34.2982 1.4428 4.2280 4.4726 0.8371 16.0548 24.4323 8.3147 7.0786 5.5636 11.0666 14.2172 24.1545 8.8515 13.2995 121.8998 37.1390 26.7189 19.2671 34.8328 17.6009 30.0837 28.0900 59.0338 51.6732 21.1782 35.1689 45.7774 32.4815 1.1371 30.3607 8.9112
temp: 298.150 k
press: 1.00000 atm
elementType: 8 8 8 6 6 6 6 6 6 6 6 6 1 1 1 1 1 1 1 1 1 1 1 1 1 1 1 1
symmnumber: 1
zpe: 629001.8 jmol-1
zpe.correction: 0.239574 hartree
zpe.thermalcorrener: 0.252459 hartree
zpe.thermalcorrenthalpy: 0.253403 hartree
zpe.thermalcorrgfe: 0.199931 hartree
zpe.sumelectzpe: -577.264472 hartree
zpe.sumelectthermal: -577.251587 hartree
zpe.sumelectthermalent: -577.250642 hartree
zpe.sumelectthermalfe: -577.304114 hartree
dipole: -1.4114 -0.2736 2.0898
dipole: 2.5365
quadrupole: -60.8405 -79.2452 -73.1891
quadrupole: -0.2410 -2.0545 0.5851
quadrupole: 10.2511 -8.1536 -2.0975 -0.2410 -2.0545 0.5851
hfenergy: -577.5040458 hartree
pointgroup: C01 [X(C9H16O3)]
dipole: 0.5783942 0.8100683 -0.0716629 debye
polarizability: 122.4824734|2.9135942|93.1072405|3.1389869|2.0880882|94.7048468 unknown
InChI: InChI=1S/C9H16O3/c1-2-12-8(10)9(11)6-4-3-5-7-9/h11H,2-7H2,1H3
charge 0 multiplicity 1
28 atoms
O  0.127704 -0.373734 2.141366
O  1.822609 0.759224 0.371091
O  0.801251 -0.453779 -1.339977
C  -0.415756 -0.008954 0.814414
C  -1.43546 -1.110642 0.461244
C  -1.101721 1.386046 0.885746
C  -2.302053 -0.774914 -0.776927
C  -1.921946 1.715787 -0.384025
C  -2.973095 0.613535 -0.654291
C  0.756242 0.039091 -0.192588
C  3.074238 0.868513 -0.441879
C  3.97532 -0.34672 -0.208868
H  -2.078226 -1.22766 1.355179
H  -0.902966 -2.067382 0.31404
H  -0.341312 2.16599 1.082893
H  -1.777379 1.349661 1.763122
H  -3.073466 -1.55973 -0.896941
H  -1.668297 -0.800827 -1.682251
H  -1.250641 1.808245 -1.261751
H  -2.414813 2.698366 -0.255204
H  -3.538398 0.843454 -1.577874
H  -3.706633 0.600638 0.178789
H  0.892359 0.23282 2.327071
H  2.789327 0.961462 -1.504632
H  3.534455 1.804541 -0.087162
H  4.926911 -0.215142 -0.756636
H  4.207767 -0.467964 0.863182
H  3.492679 -1.268026 -0.575531
