program: Gaussian 09
title: 000222084
version: EM64L-G09RevD.01
frameworkgroup: C1[X(C10H13ClO2)]
method: RPBEPBE
basis: SDD
operation: Freq
keyword: #p
keyword: freq=noraman
keyword: PBEPBE/SDD
title: #p freq=noraman PBEPBE/SDD
converged: YES YES NO NO
title: Mulliken charges:
elementType: Cl O O C C C C C C C C C C H H H H H H H H H H H H H
charge: -0.104871 -0.308778 -0.299977 0.216661 0.487875 0.051991 0.211074 -0.405265 -0.367059 -0.827948 -0.800978 -0.527376 -0.528104 0.238054 0.254614 0.222469 0.270477 0.251426 0.270602 0.275223 0.253494 0.222035 0.231043 0.258808 0.225203 0.229309
chargesum: 0.00000
title: Mulliken charges with hydrogens summed into heavy atoms:
elementType: Cl O O C C C C C C C C C C
charge: -0.104871 -0.308778 -0.299977 0.216661 0.487875 0.051991 0.211074 -0.167212 -0.112445 -0.083576 -0.255154 0.179196 0.185216
polarizability: 1.75290084e+02 2.25353261e+00 1.24284053e+02 -2.94324197e+00 5.25810399e+00 8.61907732e+01
1716.lowfreq: -12.1159 -10.7914 -1.8734 -0.0025 -0.0022 -0.0020 51.0418 62.4272 86.2544
frequency: 51.0239 62.3396 86.2482 97.0620 105.2384 131.8952 152.9720 159.1424 176.1251 191.8482 237.5354 299.6403 307.2599 323.3754 365.2790 406.0201 454.8874 476.7196 535.3598 546.5943 575.4883 620.5632 670.1264 725.3110 775.6199 832.2682 840.6089 896.2209 914.8941 950.2148 956.0540 1012.2582 1043.6128 1064.9173 1111.8736 1113.9405 1117.7735 1148.3604 1154.3379 1161.7910 1203.8331 1234.2883 1241.5243 1271.5416 1362.9844 1392.2114 1402.3403 1425.5220 1439.0888 1457.2516 1458.9260 1459.6319 1469.3127 1476.3604 1478.4384 1484.5928 1488.0234 1577.2235 1598.3071 2971.5873 2976.1375 2977.9035 3053.1267 3068.8074 3070.6958 3077.2697 3113.4326 3119.9339 3124.9709 3133.2765 3150.6568 3169.5848
redmass: 4.6925 5.3597 3.3979 2.8242 2.8498 1.0768 1.2241 1.1258 3.3191 3.0786 4.3893 3.2925 3.5288 3.7284 4.3430 5.2468 4.9353 5.5991 4.0374 5.0028 4.1520 5.5511 3.8430 5.6001 4.8930 1.5889 3.4306 2.0255 3.3272 1.3821 3.7410 3.5820 1.5120 1.7835 1.2396 1.2366 1.3366 1.2765 1.3581 1.5220 3.8865 1.4608 1.4716 3.7919 7.2450 1.2756 1.9534 1.2685 1.3735 1.0634 1.1803 1.2227 1.9974 1.1038 1.1224 1.0646 1.0596 7.4074 6.6640 1.0309 1.0400 1.0312 1.0953 1.1041 1.0577 1.1034 1.0969 1.1028 1.1034 1.0895 1.1110 1.0958
irintensity: 0.5897 2.8095 6.7269 0.0492 6.6844 0.1886 0.0453 0.4004 5.7842 7.6501 9.2356 2.0738 3.2233 4.4969 1.2502 6.5359 22.8553 5.8188 13.9659 46.5164 30.8981 11.6938 25.2162 17.9387 1.1511 19.6946 19.2846 9.2294 24.1915 1.7766 39.4087 95.6731 1.8255 41.0651 11.0697 8.5978 11.7183 1.0475 1.2077 11.8921 24.6755 69.6299 13.9069 174.3153 5.7359 24.0144 19.3711 5.0018 27.6025 18.8633 14.8405 0.8198 35.2645 9.3298 23.0666 8.8601 26.1285 2.0613 42.3149 66.5081 39.2972 59.6891 12.2477 27.0458 21.7756 23.2154 5.1888 21.7041 22.0694 8.4354 6.0821 7.2274
temp: 298.150 k
press: 1.00000 atm
elementType: 17 8 8 6 6 6 6 6 6 6 6 6 6 1 1 1 1 1 1 1 1 1 1 1 1 1
symmnumber: 1
zpe: 542994.5 jmol-1
zpe.correction: 0.206816 hartree
zpe.thermalcorrener: 0.221238 hartree
zpe.thermalcorrenthalpy: 0.222183 hartree
zpe.thermalcorrgfe: 0.165025 hartree
zpe.sumelectzpe: -998.350139 hartree
zpe.sumelectthermal: -998.335716 hartree
zpe.sumelectthermalent: -998.334772 hartree
zpe.sumelectthermalfe: -998.391929 hartree
dipole: -2.3992 0.6620 -1.6775
dipole: 3.0014
quadrupole: -85.0929 -79.0796 -83.6380
quadrupole: -2.5731 -9.5735 -2.9914
quadrupole: -2.4894 3.5239 -1.0345 -2.5731 -9.5735 -2.9914
hfenergy: -998.5569547 hartree
pointgroup: C01 [X(C10H13Cl1O2)]
dipole: -0.9142434 -0.2809551 0.6925138 debye
dipolederiv: -0.7229439 0.0290728 0.1613764 -0.0105306 -0.1986056 0.0130438 0.617823 -0.0398075 -0.4660498 -1.037103 -0.4631466 0.0801664 -0.4452285 -0.7213591 0.1068802 -0.0342673 0.0145014 -0.3652587 -1.4659835 0.1949484 -0.3748398 0.0011278 -0.3919054 0.038245 -0.2712935 0.0729633 -0.485023 0.0474016 -0.2498568 -0.0218238 -0.0373999 0.2170512 0.055905 0.0324087 0.0620922 -0.0187734 -0.3594392 0.0293219 0.0101264 0.1543752 -0.1133373 -0.0086389 -0.1559346 0.0296256 -0.1341784 0.3831124 0.4900006 0.028768 0.7310811 0.3774734 -0.0186909 0.2865456 0.1317658 -0.0349536 1.1806636 -0.1785616 0.315743 -0.3111193 0.2143989 -0.0687857 0.0579687 -0.0188644 0.0076627 0.1106426 0.0097909 0.0451457 -0.1118708 0.0237512 0.0681555 0.0345669 0.0372578 -0.1380259 -0.3023438 -0.0131711 -0.0546233 -0.1409124 -0.0195072 0.0430544 -0.165203 0.0579767 -0.1559451 -0.0622173 0.1118555 0.0365787 0.0250271 -0.1476433 -0.0524853 0.026214 -0.0274513 0.0423482 1.013129 -0.0448624 -0.2650523 -0.0620822 0.1618849 0.0060284 -0.5553973 0.0078333 0.5731764 0.5504134 0.2485385 -0.1197634 0.1084759 0.3049507 -0.1142451 -0.2563323 -0.2481787 0.3728125 0.5151722 -0.0500366 0.172368 0.1723191 0.1973592 -0.005591 0.4260844 -0.1508405 0.5275922 -0.0103823 -0.0976504 -0.0566987 -0.0795498 -0.0002021 -0.0438818 -0.0240006 -0.0568271 0.1259312 0.0644689 0.0619823 0.0098748 0.0599139 -0.0355256 -0.0385273 -0.008612 -0.0374159 0.1573754 0.06359 0.0687772 -0.0706356 0.0587958 0.0015162 0.036372 -0.0831893 0.0924571 -0.0575204 0.0525431 -0.1311182 -0.0625116 -0.0570577 0.0333363 -0.0226161 -0.0384053 -0.0425926 0.0906335 0.0118773 0.0419701 0.097265 0.0100073 0.0741049 0.022024 0.0908301 -0.0245547 0.0237151 0.0093782 0.0155676 0.0487706 0.0867784 -0.0409076 0.0809716 0.0903851 0.0494109 -0.0140776 0.006972 -0.0207139 0.0252643 -0.1074044 0.0080768 -0.0905787 0.0126203 -0.0570899 -0.0459946 -0.0015617 0.0368199 0.0540061 0.1374131 0.0127674 -0.0665226 0.0691464 -0.0035312 0.0453554 -0.0094711 0.0524746 -0.1047478 0.0046086 0.0312756 0.081777 0.0216945 0.1504545 -0.0953427 -0.013473 -0.1258353 -0.0205252 -0.1456458 -0.0309119 -0.0384904 -0.0445706 -0.0656992 0.0478244 0.1078195 0.0119236 0.0165949 -0.060763 -0.0446533 -0.1073615 -0.0358102 -0.0384855 0.0267915 0.0395802 -0.0930705 0.0723173 -0.0422094 -0.0174936 0.1190962 -0.0957287 0.1093481 -0.0936782 -0.1718453 0.0649797 -0.0231442 0.0618505 0.1041055 0.0048623 0.0024569 -0.0043482 0.0636027 unknown
polarizability: 175.3485678|-2.256742|123.8624861|-1.1856892|6.7514046|86.5538556 unknown
InChI: InChI=1S/C10H13ClO2/c1-7-8(6-11)4-5-9(12-2)10(7)13-3/h4-5H,6H2,1-3H3
charge 0 multiplicity 1
26 atoms
Cl 3.995737 0.135494 -1.157212
O  -1.549248 -1.443383 -0.437234
O  -2.50355 1.232791 0.085751
C  0.731991 -0.716241 0.044663
C  1.630206 0.328211 0.429901
C  -0.650713 -0.414889 -0.053715
C  -1.133959 0.906595 0.182523
C  1.131582 1.625773 0.710898
C  -0.23994 1.919021 0.586854
C  1.228974 -2.115953 -0.261354
C  3.096001 0.068608 0.560774
C  -2.493117 -1.853908 0.629141
C  -3.107682 1.047584 -1.256747
H  1.830309 2.416016 1.008117
H  -0.63686 2.919701 0.781523
H  1.630953 -2.612343 0.643418
H  0.409794 -2.735703 -0.655731
H  2.043337 -2.086467 -1.008053
H  3.346997 -0.937856 0.922332
H  3.617762 0.83713 1.147196
H  -3.106409 -0.996774 0.96094
H  -1.938012 -2.274478 1.488933
H  -3.12834 -2.630505 0.176402
H  -2.982647 0.007948 -1.606402
H  -2.642005 1.746495 -1.976565
H  -4.173161 1.292537 -1.131153
