program: Gaussian 09
title: 000222081
version: EM64L-G09RevD.01
frameworkgroup: C1[X(C6H11N5O3)]
method: RPBEPBE
basis: SDD
operation: Freq
keyword: #p
keyword: freq=noraman
keyword: PBEPBE/SDD
title: #p freq=noraman PBEPBE/SDD
converged: YES YES NO NO
title: Mulliken charges:
elementType: O O O N N N N N C C C C C C H H H H H H H H H H H
charge: -0.234561 -0.260452 -0.305865 -0.322646 -0.188203 -0.396557 -0.550964 -0.642018 -0.172056 -0.267128 0.165081 0.198497 -0.602542 0.294497 0.331575 0.271496 0.363718 0.310489 0.292426 0.292700 0.244087 0.247883 0.272463 0.310648 0.347431
chargesum: 0.00000
title: Mulliken charges with hydrogens summed into heavy atoms:
elementType: O O O N N N N N C C C C C C
charge: -0.234561 -0.260452 -0.305865 0.041072 -0.188203 -0.086068 0.034162 0.016061 0.159518 0.004368 0.165081 0.198497 0.161891 0.294497
polarizability: 1.16216783e+02 3.08613993e+00 1.06401027e+02 -5.36441475e+00 -6.02005549e+00 1.00045020e+02
1716.lowfreq: -16.7868 -12.0012 -0.0004 0.0004 0.0005 8.3522 45.1263 58.2415 64.5985
frequency: 45.0696 58.1765 64.5661 99.6633 120.4830 126.7511 166.3538 190.4272 239.1265 254.6199 273.0336 301.6354 328.9690 364.0461 375.5887 397.2999 468.6125 490.3860 505.9638 515.0890 544.5447 562.1764 607.7953 636.0049 670.7436 683.2820 717.2609 739.7816 749.8689 822.0173 912.6111 927.2214 948.5859 1041.3135 1066.8146 1077.3108 1103.5310 1123.8522 1129.8347 1171.2103 1208.8517 1233.8572 1278.0376 1295.3776 1328.5658 1354.5536 1370.9926 1398.3733 1415.7016 1431.9441 1476.9999 1480.2464 1482.2315 1591.2451 1598.5345 1626.7744 1644.2436 1655.8300 3011.5420 3068.4504 3086.7290 3100.7471 3143.0036 3462.1731 3538.1130 3538.7793 3546.5680 3596.7187 3697.9628
redmass: 5.9636 5.8943 5.2339 4.2708 1.0673 5.1796 4.9681 4.0772 4.8281 1.1356 1.8966 1.8695 3.4531 4.4333 5.0658 4.5687 1.3405 5.4320 4.5894 1.1433 3.7010 4.4118 1.4648 3.7781 2.3963 2.4098 9.0936 5.9367 5.1697 4.6752 2.5158 2.7337 3.3835 2.1014 1.9666 2.2273 4.0475 2.9024 1.3308 2.3892 2.2875 2.2203 1.7590 1.4971 3.5795 1.7630 1.4962 1.3738 1.6075 1.4200 1.0481 2.0721 1.1810 8.8245 1.4748 1.1456 3.2159 4.7143 1.0335 1.0861 1.0865 1.1020 1.1018 1.0449 1.0702 1.0750 1.0553 1.0987 1.1044
irintensity: 1.3693 6.1087 13.8657 4.0256 0.1875 13.9969 3.9167 0.5591 4.0655 4.2637 19.2982 37.7490 19.3548 10.2109 20.4368 9.2061 274.9895 29.3274 40.1851 69.8852 7.4543 17.0595 211.8556 30.9905 66.9628 51.7940 28.6464 13.0131 90.3832 19.9746 19.6373 6.5023 1.7230 1.4290 65.8645 123.7459 64.1171 16.2273 0.1253 13.7456 62.7194 63.5148 134.7965 24.5186 100.9565 62.7191 34.9751 31.6087 33.9162 91.1476 9.8615 364.9868 121.1060 371.2776 65.7511 54.2601 374.8041 242.0996 27.8234 12.9040 3.9964 19.3426 0.3597 6.6995 6.7657 91.1399 36.2215 9.6606 40.8923
temp: 298.150 k
press: 1.00000 atm
elementType: 8 8 8 7 7 7 7 7 6 6 6 6 6 6 1 1 1 1 1 1 1 1 1 1 1
symmnumber: 1
zpe: 510116.2 jmol-1
zpe.correction: 0.194293 hartree
zpe.thermalcorrener: 0.208786 hartree
zpe.thermalcorrenthalpy: 0.209730 hartree
zpe.thermalcorrgfe: 0.152758 hartree
zpe.sumelectzpe: -733.648916 hartree
zpe.sumelectthermal: -733.634423 hartree
zpe.sumelectthermalent: -733.633479 hartree
zpe.sumelectthermalfe: -733.690451 hartree
dipole: 1.1833 -2.2119 2.8070
dipole: 3.7646
quadrupole: -77.8271 -93.3070 -77.9734
quadrupole: -1.8071 17.5349 5.7253
quadrupole: 5.2087 -10.2711 5.0624 -1.8071 17.5349 5.7253
hfenergy: -733.8432089 hartree
pointgroup: C01[X(C6H11N5O3)]
dipole: 0.7263696 0.8755256 -0.9484367 debye
dipolederiv: -0.4821112 0.165006 -0.2127841 0.0343237 -0.9559098 0.2438742 -0.1462151 0.3508995 -0.5610401 -0.7701225 -0.2617035 -0.0661531 -0.3894504 -1.0891214 0.0603758 -0.1065821 0.0871952 -0.4068131 -0.7068209 0.1738367 0.0100258 0.2144087 -0.6436075 0.2662558 0.0191912 0.2562311 -0.8495007 -1.2050623 -0.0599089 -0.0555129 -0.2974552 -0.4433746 -0.0294962 -0.3337237 -0.137262 -0.6708414 -0.5267795 -0.1366247 -0.2336454 0.0445138 -1.4792457 0.2629894 -0.2506152 0.2686068 -0.4118875 -1.2341557 0.2314764 0.2178514 0.4692363 -0.8563863 -0.206641 0.3115059 -0.0094058 -0.3782756 -0.592056 -0.0628745 -0.1802596 0.0134134 -0.3104872 -0.1969579 -0.1556081 -0.2546478 -0.7388312 -0.9769318 -0.0930889 0.3231221 -0.0587236 -0.4533936 -0.2301667 0.4940815 -0.2575162 -0.9658329 0.9620855 0.0752955 -0.299217 0.449624 0.432945 0.0360259 -0.5943792 0.1364003 0.4933448 0.2606224 0.0306132 -0.0574871 -0.0573537 0.1862969 0.1114577 -0.0913663 0.156963 0.3426962 0.3992092 0.2460096 0.3034018 0.1429457 1.5260775 -0.2964487 0.3338002 -0.302568 0.4201644 1.426187 0.0853144 0.4386225 0.1824493 1.6447233 -0.3145532 0.656864 -0.4052095 0.6016726 0.3342476 -0.0443615 0.0919336 0.0252866 0.0547338 0.0544404 0.0936791 0.0496171 0.26942 1.641783 -0.6216224 -0.5077251 -0.8250943 0.9612827 -0.1620518 -0.507772 -0.24009 1.3789229 -0.0103562 -0.0315003 -0.034984 -0.0528895 0.094846 0.0464102 -0.0005957 -0.0209426 0.004608 0.0179569 -0.0540499 0.0257423 -0.1078209 -0.0106904 0.0301254 0.0370222 0.0373676 0.0108284 0.2411755 -0.0314651 -0.0966943 -0.0689303 0.1763466 -0.0057677 -0.0315728 -0.0192664 0.3488324 0.1665597 0.1185077 -0.0087761 0.081848 0.2350628 0.0522784 0.0281292 0.052537 0.1045384 0.1809563 0.1639637 0.1032701 0.0828923 0.1724139 0.0734048 0.0486059 0.1094802 0.2359588 0.178869 -0.0809868 0.0969983 -0.067814 0.1120634 0.039347 0.0696847 0.005056 0.2808046 0.0298488 -0.010765 0.0587986 0.0053401 0.1045369 0.0524562 -0.0168485 -0.000888 -0.1089383 -0.0325159 0.0440797 -0.0029228 0.1360123 0.0222899 -0.0394795 0.0242232 -0.0568515 0.0458147 0.1309586 -0.0183486 -0.0027803 -0.1104464 0.0175361 -0.0317618 0.0411494 0.0307084 0.1352302 0.2714162 0.1009402 0.0528067 0.0920117 0.2229873 0.1022367 0.0307615 0.0908909 0.2008121 0.2950363 0.0722572 0.0363685 0.0616723 0.2780744 0.0816467 0.0465808 0.0726946 0.2183119 unknown
polarizability: 113.4951937|-5.6668016|111.2156742|2.8054795|-5.5213677|97.9519625 unknown
InChI: InChI=1S/C6H11N5O3/c1-11-4(12)2(7)3(9-5(8)13)10-6(11)14/h2-3,9-10H,7-8H2,1H3
charge 0 multiplicity 1
25 atoms
O  -1.64518 2.130251 -1.079414
O  -1.862255 -2.347698 0.301895
O  2.876835 -1.682441 0.639487
N  -0.064524 -1.028949 0.98641
N  -1.756976 -0.106564 -0.42571
N  1.66882 -0.001117 -0.42611
N  -0.601816 1.722125 1.99723
N  3.494501 -1.032328 -1.518105
C  0.815397 0.135911 0.763581
C  -0.066463 1.391625 0.666854
C  -1.192089 1.181163 -0.375152
C  -1.24855 -1.245915 0.298941
C  -2.962648 -0.30233 -1.264598
C  2.697206 -0.94974 -0.384052
H  1.467064 0.213935 1.647545
H  0.540878 2.241147 0.313087
H  0.375758 -1.862434 1.385602
H  1.40469 0.467244 -1.29476
H  -1.103349 2.613889 2.034453
H  -1.107716 0.953587 2.449945
H  -2.721303 -0.126053 -2.326109
H  -3.745935 0.413521 -0.966362
H  -3.3078 -1.335332 -1.116098
H  3.43009 -0.388036 -2.303006
H  4.229565 -1.735161 -1.513155
