program: Gaussian 09
title: 000222067
version: EM64L-G09RevD.01
frameworkgroup: C1[X(C8H6N2O6)]
method: RPBEPBE
basis: SDD
operation: Freq
keyword: #pfreq=noraman
keyword: PBEPBE/SDD
title: #p freq=noraman PBEPBE/SDD
converged: YES YES NO NO
title: Mulliken charges:
elementType: O O O O O O N N C C C C C C C C H H H H H H
charge: -0.282086 -0.228657 -0.180329 -0.184383 -0.181767 -0.181005 0.023132 0.021841 0.308087 0.436363 0.438861 -0.463526 -0.488261 -0.485551 0.194897 -0.495131 0.331880 0.330800 0.341432 0.242907 0.250300 0.250197
chargesum: 0.00000
title: Mulliken charges with hydrogens summed into heavy atoms:
elementType: O O O O O O N N C C C C C C C C
charge: -0.282086 -0.228657 -0.180329 -0.184383 -0.181767 -0.181005 0.023132 0.021841 0.308087 0.436363 0.438861 -0.131646 -0.157461 -0.144119 0.194897 0.248273
polarizability: 1.78059056e+02 9.05494737e-01 1.59313096e+02 1.91852406e-02 -3.69459105e-02 5.11876940e+01
1716.lowfreq: -4.7152 -0.0007 0.0006 0.0009 7.8781 8.1650 39.0494 49.5187 50.6219
frequency: 38.9992 49.5086 50.6176 67.3498 91.7484 98.5976 143.2390 152.4560 197.1889 223.4957 235.7408 303.6207 307.9226 341.5221 353.2510 466.2863 476.7739 481.3779 503.2962 584.3875 637.6540 683.7991 684.5464 698.3377 724.6802 742.1935 744.9122 833.9863 868.0101 948.0610 975.0145 980.2002 987.4854 992.9823 1069.4754 1091.8034 1115.8837 1121.5558 1152.8986 1206.5486 1209.7690 1233.5263 1264.6010 1380.9490 1384.1462 1406.2803 1424.2485 1436.4801 1452.5109 1460.9127 1463.6048 1588.9692 1618.2491 1634.7308 3011.6007 3116.7221 3160.1502 3179.1862 3191.5605 3197.5674
redmass: 3.3965 10.2436 14.1723 1.3559 5.3620 5.6579 13.5722 5.1709 4.9270 4.5412 6.0397 7.7140 6.6600 10.3308 11.6987 5.6695 5.5361 8.1084 9.3352 4.8867 6.4282 12.2418 8.0337 2.8369 9.1187 6.4834 9.7409 8.3972 11.3603 8.4073 1.4462 1.5827 6.2669 1.4052 1.4349 1.5109 1.2632 5.3661 1.5346 14.0956 10.8063 1.2315 6.1850 10.6311 10.0407 5.6897 1.2047 5.6066 1.0491 1.0682 3.8830 8.1371 8.1493 10.1830 1.0295 1.1050 1.1053 1.0927 1.0927 1.0930
irintensity: 1.1024 0.0086 0.0044 0.2028 2.1753 0.5318 3.3955 12.8148 0.0291 2.6003 8.9069 1.3966 10.1026 0.3725 4.0318 0.0191 0.2700 4.4748 3.9755 0.0056 2.1956 42.4018 25.5003 43.6815 0.0000 10.4245 6.6531 2.3569 18.4574 27.2276 17.5059 26.4930 1.0263 5.2141 97.5906 3.5677 0.0890 184.5108 52.3086 278.8756 266.8393 0.2703 94.1821 41.9668 136.1111 9.3291 38.4851 19.6627 17.0041 13.3771 19.7084 4.0721 12.4731 166.5896 26.6964 20.1398 10.1004 15.9335 25.4597 10.6836
temp: 298.150 k
press: 1.00000 atm
elementType: 8 8 8 8 8 8 7 7 6 6 6 6 6 6 6 6 1 1 1 1 1 1
symmnumber: 1
zpe: 372296.8 jmol-1
zpe.correction: 0.141800 hartree
zpe.thermalcorrener: 0.156377 hartree
zpe.thermalcorrenthalpy: 0.157321 hartree
zpe.thermalcorrgfe: 0.097990 hartree
zpe.sumelectzpe: -867.971070 hartree
zpe.sumelectthermal: -867.956493 hartree
zpe.sumelectthermalent: -867.955549 hartree
zpe.sumelectthermalfe: -868.014880 hartree
dipole: 5.1153 0.5874 -0.0065
dipole: 5.1490
quadrupole: -86.7418 -118.2357 -87.5931
quadrupole: 1.9500 -0.0425 0.0202
quadrupole: 10.7817 -20.7122 9.9304 1.9500 -0.0425 0.0202
hfenergy: -868.1128702 hartree
pointgroup: C01 [X(C8H6N2O6)]
dipole: -2.0120401 -0.2227058 -0.0761187 debye
dipolederiv: -1.4191184 -0.2474615 -0.0467091 -0.5354699 -0.6480175 -0.0294937 -0.0564776 -0.0192422 -0.2887869 -0.748017 0.2452267 -0.0079847 -0.006725 -0.8170096 -0.0157096 -0.0157419 -0.006256 -0.3097982 -0.4966854 -0.0721603 -0.0113855 0.0062493 -0.7857129 -0.0141854 -0.0094164 -0.0166636 -0.2064252 -0.5438273 -0.0737156 -0.0135721 -0.1431391 -0.7443831 -0.0184436 -0.0151873 -0.0159418 -0.2091112 -0.7991557 0.0043197 -0.0194022 -0.0773649 -0.4925829 -0.0095789 -0.0213059 -0.0068582 -0.2095918 -0.6975203 0.1119435 -0.0142362 0.1964022 -0.5907426 -0.0028514 -0.012021 -0.0058093 -0.2079714 1.3220958 0.3103338 0.0453039 0.3201532 1.3112418 0.0385661 0.0454617 0.0380874 0.1830348 1.0515982 -0.1626655 0.0264888 -0.1805246 1.573733 0.028854 0.0257204 0.0294473 0.180489 -0.3182862 -0.0196953 -0.0114655 -0.0171153 -0.3076288 -0.0087609 -0.0110033 -0.0091001 0.0053029 -0.2695288 -0.0785511 -0.0131937 -0.0884402 -0.2963343 -0.0120219 -0.0134581 -0.0116275 0.0692699 -0.2067119 0.0324888 -0.0086028 0.0408482 -0.3713415 -0.0096203 -0.0085925 -0.009898 0.0695378 0.0477291 -0.1528363 -0.0004563 -0.0561896 0.0716709 0.001202 0.001743 -0.0017666 -0.051327 0.1312656 0.1095537 0.0086876 0.0451643 -0.0108083 0.0025216 0.0075309 0.0048383 -0.049247 -0.1356817 0.0842535 -0.0006273 0.083859 0.1843388 0.0086855 -0.0004762 0.0088879 -0.0537889 1.812573 -0.0807955 0.0523241 0.3961924 1.1630805 0.0423079 0.0662779 0.024276 0.2402656 0.7758586 0.0719351 0.0191689 0.0204508 0.2150044 -0.0009387 0.0191562 0.0014306 0.2752383 0.1717189 -0.0228505 -0.0003903 -0.0583138 0.1474488 -0.002492 -0.0011701 -0.0013793 0.1684814 0.1965392 0.0126655 0.0012522 0.0145772 0.1295829 -0.0004568 0.0011542 -0.0005225 0.1684727 0.1595083 0.0111709 -0.000517 0.0095532 0.1938625 0.0005783 -0.0005843 0.0005804 0.1837845 0.0173547 -0.0450782 -0.005425 -0.1108496 -0.0463981 -0.0102367 -0.0077022 -0.0077682 0.1267582 -0.0237428 -0.0217123 0.0016235 0.0685782 0.0548184 0.1023152 -0.0434027 0.0729147 -0.0378427 -0.0279658 -0.0163693 -0.0008812 0.072104 0.0661776 -0.0902406 0.0494951 -0.0676296 -0.0467447 unknown
polarizability: 177.9213387|0.7357681|159.23686|4.2833762|2.7591912|51.4016474 unknown
InChI: InChI=1S/C8H6N2O6/c1-16-8(11)5-2-6(9(12)13)4-7(3-5)10(14)15/h2-4H,1H3
charge 0 multiplicity 1
22 atoms
O  -3.320945 -0.295729 -0.155727
O  -2.845824 1.986685 -0.072402
O  1.976443 3.274275 0.114649
O  0.164026 -3.648232 -0.118345
O  3.598022 1.667401 0.128283
O  2.363937 -3.046487 -0.027097
N  2.367763 2.04774 0.097276
N  1.106362 -2.771566 -0.063758
C  -1.027082 0.362083 -0.056791
C  1.318024 0.987857 0.036599
C  0.711205 -1.33239 -0.041275
C  -0.657524 -1.002873 -0.078871
C  -0.035984 1.369832 0.001497
C  1.726016 -0.359123 0.016738
C  -2.462508 0.794228 -0.093863
C  -4.770536 0.025992 -0.197348
H  -1.414361 -1.789084 -0.124144
H  -0.321979 2.425719 0.018669
H  2.782932 -0.636024 0.045182
H  -5.271206 -0.949926 -0.24973
H  -4.994327 0.640447 -1.084871
H  -5.059853 0.577178 0.712529
