program: Gaussian 09
title: 000221142
version: EM64L-G09RevD.01
frameworkgroup: C1[X(C7H14N2OS)]
method: RPBEPBE
basis: SDD
operation: Freq
keyword: #p
keyword: freq=noraman
keyword: PBEPBE/SDD
title: #p freq=noraman PBEPBE/SDD
converged: YES YES NO NO
title: Mulliken charges:
elementType: S O N N C C C C C C C H H H H H H H H H H H H H H
charge: 0.094027 -0.440613 -0.606971 -0.325227 -0.509108 -0.021039 -0.351226 -0.420649 -0.397407 -0.393435 -0.049582 0.350697 0.188939 0.226071 0.203632 0.220381 0.213459 0.203371 0.201908 0.192477 0.206605 0.332018 0.320083 0.329645 0.231943
chargesum: 0.00000
title: Mulliken charges with hydrogens summed into heavy atoms:
elementType: S O N N C C C C C C C
charge: 0.094027 -0.108595 0.042757 -0.093284 -0.158411 0.167900 0.078477 0.013191 0.007872 0.005647 -0.049582
polarizability: 1.45403556e+02 1.48026407e+00 8.95655220e+01 1.36239312e-01 -6.99045600e+00 9.60383765e+01
1716.lowfreq: -21.0112 -12.3324 -8.8186 0.0008 0.0013 0.0014 23.7306 31.6488 74.9469
frequency: 23.6833 31.5617 74.9208 136.5128 183.3453 205.0029 257.3196 308.4819 342.4262 346.4905 373.9758 406.2164 411.9241 418.4566 442.7197 462.4525 465.2750 534.6340 558.7414 578.5410 701.0498 722.6321 788.6786 834.0233 860.8317 888.2045 937.1514 944.1156 973.5914 1024.4532 1042.6187 1047.8569 1055.1625 1098.6468 1110.0584 1123.6832 1197.2503 1218.8188 1234.6081 1252.6937 1262.1635 1279.3207 1297.1128 1310.2601 1325.2104 1334.5001 1340.1575 1349.6656 1376.5054 1461.0121 1463.7130 1468.1007 1474.7834 1615.1958 1652.3120 2914.1983 2970.5271 2977.4291 2981.0582 2993.3441 2999.7985 3035.4656 3041.7751 3058.8921 3061.7855 3384.1392 3474.3593 3525.5378 3674.0028
redmass: 4.9421 4.6433 3.5427 4.2852 2.3873 6.7404 4.8995 1.7134 1.1184 2.5598 3.0025 2.1684 1.6529 2.3547 1.4813 2.9994 5.3010 2.2805 3.0279 2.8132 3.2937 1.4300 1.8803 1.9010 1.7497 1.8521 2.3669 2.0747 1.7513 2.8069 1.5769 1.4924 2.0159 1.8236 1.8547 2.2024 1.5116 1.2063 1.3085 1.3257 1.2396 2.2821 1.2899 1.2295 1.3076 1.4143 1.4661 1.4016 1.5932 1.0902 1.0887 1.0813 1.0922 1.2179 4.6630 1.0834 1.0636 1.0626 1.0660 1.0622 1.0827 1.0957 1.1004 1.1008 1.1026 1.0776 1.0648 1.0448 1.1043
irintensity: 6.2258 6.8281 3.3083 1.1923 1.9021 10.1209 3.3786 0.0453 11.0038 4.4856 9.5130 109.8103 199.8560 34.7328 79.9528 9.6170 4.7751 5.6693 25.0740 92.0716 20.9017 83.3947 1.2941 11.6720 10.5192 1.3632 5.0465 73.3627 118.9833 62.8645 7.1916 1.7442 2.2685 12.9827 10.0394 2.6089 4.8279 12.4742 12.3212 43.4249 20.5231 176.4909 7.2524 6.7496 2.8880 0.4368 0.2603 18.5531 19.4821 8.3184 7.5432 17.1431 7.2279 113.2956 235.4818 52.8196 41.2756 30.8994 23.7128 18.1498 26.0712 59.0535 56.5121 1.4507 72.6224 17.5605 14.2876 35.2801 23.4087
temp: 298.150 k
press: 1.00000 atm
elementType: 16 8 7 7 6 6 6 6 6 6 6 1 1 1 1 1 1 1 1 1 1 1 1 1 1
symmnumber: 1
zpe: 548614.2 jmol-1
zpe.correction: 0.208956 hartree
zpe.thermalcorrener: 0.221324 hartree
zpe.thermalcorrenthalpy: 0.222268 hartree
zpe.thermalcorrgfe: 0.169373 hartree
zpe.sumelectzpe: -857.038768 hartree
zpe.sumelectthermal: -857.026400 hartree
zpe.sumelectthermalent: -857.025455 hartree
zpe.sumelectthermalfe: -857.078351 hartree
dipole: 3.2637 -1.8260 -0.8200
dipole: 3.8286
quadrupole: -49.7576 -81.7258 -75.0623
quadrupole: 2.8321 2.9064 -3.7445
quadrupole: 19.0910 -12.8772 -6.2138 2.8321 2.9064 -3.7445
hfenergy: -857.2477239 hartree
pointgroup: C01 [X(C7H14N2O1S1)]
dipole: 1.3582984 0.5780579 0.2996449 debye
dipolederiv: -0.8385187 0.0655695 0.1097785 0.0074611 -0.2406903 0.0344018 0.126745 0.0426857 -0.272545 -0.4528545 0.0495794 0.1428219 0.0670925 -0.8565809 0.0287215 0.1333284 0.0149703 -0.3977014 -1.2492929 0.1582855 -0.3956955 0.1193673 -0.6902719 -0.005831 -0.1785093 -0.0270477 -0.4366877 -0.3458579 0.0470151 -0.2580172 -0.0550994 -0.4818004 0.2163283 0.1506679 0.164514 -1.1853718 0.569947 -0.171159 0.1303873 -0.1444684 0.0607389 -0.0212374 0.3584803 -0.0482899 -0.0513419 0.2816416 -0.0837297 -0.0996685 -0.004016 0.5403096 0.0505953 -0.219027 -0.0279706 0.3501983 -0.0887001 0.0069784 -0.0501761 -0.0308056 0.01427 -0.0039811 -0.1380774 0.073343 0.1163929 0.0123337 0.0599884 -0.0468077 -0.0742607 0.0212209 -0.0190116 0.0250995 0.0382035 0.1063991 0.084975 -0.0174924 -0.025117 0.0688509 0.0407803 0.0381243 0.0414063 -0.0391679 0.1452067 0.0857256 -0.0102411 -0.002111 -0.0278084 0.0521871 -0.0005057 -0.0580931 0.0235027 0.152945 1.5495664 -0.2177952 0.1592997 -0.0983525 0.1348459 -0.3003304 -0.4073302 -0.2562257 1.3008222 0.1195734 0.0041826 -0.0504632 0.0393351 0.0390466 -0.0062802 -0.1000016 -0.0020233 0.0175437 -0.0123934 0.0142534 0.029422 0.0191555 -0.0275388 -0.0567564 0.0912 -0.0453534 -0.1994434 -0.0620103 -0.1234682 0.0025846 -0.0948082 -0.0398736 0.0123996 0.016391 0.0279298 0.0663565 0.0485 0.0428595 0.0461373 0.0256573 0.0546875 0.0307243 0.0420645 -0.0433894 -0.1450445 -0.1071081 -0.1123034 0.0052945 -0.117382 -0.0588312 0.0163984 0.008428 0.0382853 0.0755597 0.0548683 0.0382976 0.0815639 0.0258492 0.0627883 0.0013048 0.0287391 -0.0296051 -0.1287225 0.0195644 -0.0297569 0.0654804 -0.0212561 0.0842381 -0.03861 0.0375879 0.0275298 -0.1574216 -0.0263413 0.0946397 -0.0092588 0.093939 -0.2027763 -0.0195852 -0.0087069 -0.0473349 0.0716614 0.0544663 -0.0109233 0.0514931 -0.0092793 0.0191511 -0.0126983 0.1371874 -0.0365834 -0.1628228 -0.1559448 0.0482249 -0.1125122 0.0496903 0.0330773 0.0266652 -0.1541958 0.0368091 -0.0002998 0.1640573 0.1256052 -0.1133181 0.1010432 0.3835948 -0.0528652 -0.0894646 0.0060959 0.2170015 0.1488252 0.0184264 0.0388384 0.0179359 0.3779104 0.0512178 0.0324324 0.0526503 0.1435576 0.26192 0.0076309 0.0413262 0.010633 0.3872322 0.0503056 0.0238545 0.0536377 0.149097 -0.1169422 -0.0046672 0.2587177 0.0315264 0.2922843 -0.0194943 0.0997937 0.0028343 0.2246606 unknown
polarizability: 143.6937839|-8.9529408|88.8819371|2.9509125|-6.1345147|98.4317337 unknown
InChI: InChI=1S/C7H14N2OS/c8-7(9)11-6-4-2-1-3-5(6)10/h5-6,8,10H,1-4,9H2
charge 0 multiplicity 1
25 atoms
S  1.362914 -0.162952 1.298935
O  -0.845385 -2.126428 0.134662
N  3.948149 -0.328022 0.585324
N  2.414724 0.270123 -1.211071
C  -0.160704 0.275158 0.221556
C  -1.270153 -0.767021 0.481697
C  -0.639283 1.712657 0.496429
C  -2.504617 -0.445352 -0.382236
C  -1.888575 2.029813 -0.366149
C  -3.012788 0.993122 -0.127386
C  2.71108 -0.045388 0.015259
H  0.24079 0.17783 -0.806513
H  -1.557378 -0.719812 1.558396
H  0.179696 2.419607 0.272841
H  -0.890533 1.828868 1.570032
H  -3.289068 -1.193258 -0.164657
H  -2.220713 -0.569479 -1.445539
H  -1.603379 2.020243 -1.437577
H  -2.247804 3.051018 -0.135532
H  -3.37658 1.080739 0.917427
H  -3.877231 1.206454 -0.784528
H  0.058038 -2.261454 0.531557
H  4.793664 -0.294699 0.019145
H  4.033246 -0.55555 1.574677
H  3.205289 0.312781 -1.878946
