program: Gaussian 09
title: 000221132
version: EM64L-G09RevD.01
frameworkgroup: C1[X(C8H11N)]
method: RPBEPBE
basis: SDD
operation: Freq
keyword: #pfreq=noraman
keyword: PBEPBE/SDD
title: #p freq=noraman PBEPBE/SDD
converged: YES YES NO YES
title: Mulliken charges:
elementType: N C C C C C C C C H H H H H H H H H H H
charge: -0.000107 -0.214684 0.496112 -0.687933 -0.687946 -0.322637 -0.517498 -0.200442 -0.334807 0.206200 0.208472 0.216373 0.229766 0.229767 0.216375 0.208462 0.240112 0.246637 0.227424 0.240356
chargesum: 0.00000
title: Mulliken charges with hydrogens summed into heavy atoms:
elementType: N C C C C C C C C
charge: -0.000107 -0.008484 0.496112 -0.033322 -0.033342 -0.082526 -0.270862 0.026982 -0.094451
polarizability: 1.15005439e+02 -2.76589171e+00 8.91074102e+01 -1.95822372e-03 8.38993326e-03 5.81784873e+01
1716.lowfreq: -19.9450 -14.4196 -2.0911 -0.0004 0.0005 0.0006 41.2598 123.4714 196.8747
frequency: 40.8862 123.4702 196.8726 212.9632 253.9869 294.0504 296.8579 398.0416 449.5798 543.2923 564.6953 616.2161 725.1580 751.8087 819.3973 886.4546 915.2394 925.8198 941.5386 956.0968 985.5209 1003.9708 1023.1167 1060.2591 1102.5934 1114.1310 1155.7530 1197.5642 1232.1254 1295.3615 1306.1431 1314.3760 1355.5273 1377.9803 1396.0556 1416.0398 1457.6924 1467.0272 1467.9610 1479.0532 1487.9529 1557.1309 1584.3513 2974.4679 2977.1914 2980.4406 3066.9847 3074.5884 3079.1093 3083.1199 3109.4781 3123.8691 3132.3274 3161.0235
redmass: 3.2385 3.0264 2.1846 1.0369 1.1998 2.7580 2.9391 3.2110 2.9076 3.6499 3.0566 6.7578 1.7999 4.4243 1.7336 2.6884 1.2024 1.3110 1.4591 1.4845 1.3924 3.6238 3.1790 1.5674 1.7191 2.5571 1.6671 1.4503 1.6901 2.6143 1.3307 2.9883 1.2776 1.1933 1.2031 2.0105 2.0017 1.0494 1.0459 1.0494 1.0944 5.3392 5.8633 1.0350 1.0365 1.0830 1.1000 1.0991 1.1007 1.0999 1.0907 1.0873 1.0919 1.0999
irintensity: 0.9183 0.4194 0.6498 0.0006 0.3174 0.5782 0.0396 2.5956 0.5555 3.4481 0.7661 3.1046 38.9382 0.2775 30.8705 0.7749 0.5265 3.8930 1.6010 0.0002 0.0315 11.7538 4.6971 17.7061 10.2189 1.1409 0.8517 0.4362 3.3012 8.3016 0.5763 3.8444 0.7114 15.4927 11.0342 18.3237 13.1077 6.5124 0.0448 17.7125 23.4385 4.7259 0.2956 29.9332 27.2945 18.6727 0.8221 89.5484 23.5655 40.2041 29.9080 2.5861 25.1950 27.2314
temp: 298.150 k
press: 1.00000 atm
elementType: 7 6 6 6 6 6 6 6 6 1 1 1 1 1 1 1 1 1 1 1
symmnumber: 1
zpe: 445685.0 jmol-1
zpe.correction: 0.169752 hartree
zpe.thermalcorrener: 0.178523 hartree
zpe.thermalcorrenthalpy: 0.179467 hartree
zpe.thermalcorrgfe: 0.135902 hartree
zpe.sumelectzpe: -365.519866 hartree
zpe.sumelectthermal: -365.511096 hartree
zpe.sumelectthermalent: -365.510151 hartree
zpe.sumelectthermalfe: -365.553717 hartree
dipole: 2.2087 1.9868 0.0006
dipole: 2.9708
quadrupole: -54.8057 -53.4430 -57.2531
quadrupole: -6.9716 -0.0024 0.0013
quadrupole: 0.3615 1.7243 -2.0858 -6.9716 -0.0024 0.0013
hfenergy: -365.6896189 hartree
pointgroup: C01 [X(C8H11N1)]
dipole: 0.8787258 -0.7706881 -0.0005869 debye
dipolederiv: -0.3774239 0.0181322 0.0000335 0.0066959 -0.3156186 -0.0000434 0.0000301 -0.0000503 -0.2314763 0.0826714 0.0309638 0.0000498 0.1276709 0.1671282 0.0000067 0.0002027 0.0000352 0.1225554 0.3097666 0.0728202 -0.0000851 -0.0035338 -0.2266855 -0.0000812 -0.0001452 -0.0000923 -0.0512024 -0.0337322 0.0183802 0.0367409 -0.0184318 0.0663501 -0.0212906 -0.0280092 -0.0426276 -0.0290175 -0.0337187 0.0184543 -0.0367146 -0.0184591 0.0662519 0.0214445 0.0279306 0.0427607 -0.0289106 -0.0034177 -0.02408 -0.0000226 -0.1169528 0.1050388 0.0001416 -0.0000799 0.0001223 -0.1245644 0.008118 -0.0559004 -0.000038 0.1522111 0.3146168 0.0001763 0.0000638 0.0002123 -0.086938 -0.1721179 0.0214193 0.0000229 0.1701453 0.0583454 0.000055 0.0000969 0.0000797 -0.1059978 0.3307168 0.0844805 -0.0000263 -0.0878185 0.0725759 0.0001022 -0.0001173 0.0000723 -0.0950401 0.0328946 0.0216592 0.0000062 -0.0446866 -0.1758869 -0.0001422 -0.0000413 -0.0001434 0.021139 0.0958394 -0.0511884 0.009958 -0.0116659 -0.153043 -0.036207 0.0070918 0.0294446 0.0670794 -0.2202999 -0.0483259 0.0396718 -0.0468944 0.082221 -0.0124515 0.0193132 -0.0144479 0.0769787 0.0738005 0.0520276 -0.0973913 0.0349387 0.0490106 0.0789827 -0.063482 0.0528649 -0.1117083 0.0738947 0.0518461 0.0973629 0.0348037 0.0492079 -0.078755 0.0634149 -0.0526679 -0.1120096 -0.2203183 -0.0482558 -0.0395741 -0.0468659 0.0821816 0.012481 -0.0191891 0.014479 0.0770544 0.0958442 -0.0511936 -0.0100398 -0.0116342 -0.1530656 0.0358824 -0.0071247 -0.0297377 0.0670964 0.0141787 0.1131239 0.0000805 0.1107273 -0.0075558 -0.0000878 0.000087 -0.0000868 0.1264245 0.0300045 -0.0970899 -0.0000377 -0.0997058 -0.0689804 -0.00008 -0.0000408 -0.000082 0.1226619 0.0458613 -0.0705588 -0.0000156 -0.0988932 -0.0896766 -0.0001086 -0.0000335 -0.0001148 0.1573274 -0.1325621 -0.0567145 0.0000184 -0.0316509 0.0775842 -0.000025 0.000032 -0.0000201 0.1385478 unknown
polarizability: 114.9319328|3.0900494|89.1809105|-0.0095871|0.0140544|58.1784936 unknown
InChI: InChI=1S/C8H11N/c1-7(2)8-4-3-5-9-6-8/h3-7H,1-2H3
charge 0 multiplicity 1
20 atoms
N  -2.003323 1.089276 0.000874
C  1.788096 0.428621 -0.000181
C  0.283369 0.164265 0.000004
C  2.464193 -0.132699 -1.279611
C  2.464924 -0.134613 1.278014
C  -0.256531 -1.148491 -0.00058
C  -0.6451 1.237587 0.000715
C  -1.65633 -1.328302 -0.000424
C  -2.490671 -0.185856 0.000307
H  1.929334 1.528631 0.000603
H  2.364511 -1.233085 -1.332651
H  3.543445 0.107745 -1.28363
H  2.010576 0.293034 -2.192496
H  2.011845 0.289758 2.191799
H  3.54418 0.105821 1.281761
H  2.365285 -1.235077 1.329475
H  0.407967 -2.02067 -0.001152
H  -0.283058 2.274353 0.001188
H  -2.097921 -2.330213 -0.00086
H  -3.582488 -0.282883 0.000447
