program: Gaussian 09
title: 000221128
version: EM64L-G09RevD.01
frameworkgroup: C1[X(C5H5NO4S)]
method: RPBEPBE
basis: SDD
operation: Freq
keyword: #p
keyword: freq=noraman
keyword: PBEPBE/SDD
title: #p freq=noraman PBEPBE/SDD
converged: YES YES NO NO
title: Mulliken charges:
elementType: S O O O O N C C C C C H H H H H
charge: 1.000692 -0.562768 -0.490334 -0.486563 -0.309822 0.041642 0.024201 -0.232923 -0.206495 -0.151225 -0.191879 0.331096 0.299869 0.253102 0.291353 0.390054
chargesum: 0.00000
title: Mulliken charges with hydrogens summed into heavy atoms:
elementType: S O O O O N C C C C C
charge: 1.000692 -0.172714 -0.490334 -0.486563 -0.309822 0.041642 0.024201 0.098174 0.093374 0.101877 0.099474
polarizability: 1.37633944e+02 -8.59199788e+00 1.12409785e+02 1.15993539e+00 2.32408783e-01 5.80902526e+01
1716.lowfreq: -13.1043 -0.0027 -0.0022 -0.0019 5.2470 9.6265 29.8893 101.6062 122.8182
frequency: 29.4240 101.6046 122.8157 176.1073 199.0319 216.8432 236.8481 265.9937 327.2709 333.0419 423.8091 444.2111 477.4402 527.1002 535.4792 584.8369 659.1013 670.8591 785.6359 830.4189 860.2539 866.1238 886.3191 967.8973 970.2847 983.7885 1049.4699 1062.8285 1074.8743 1162.4485 1242.9622 1266.1012 1289.1288 1419.4680 1462.4866 1513.1226 1614.7750 3173.7309 3191.7186 3208.6868 3217.7901 3481.1295
redmass: 7.3011 6.2854 9.3794 1.6582 4.4761 6.4972 7.0165 2.8524 10.3864 12.1980 10.8259 3.2278 5.8979 8.3583 9.8089 7.2544 2.4295 6.7637 1.3747 12.5226 3.9623 1.7776 1.3832 1.5182 6.3446 5.6510 1.2621 1.7521 1.7686 1.1379 3.6496 4.5581 1.4930 2.0888 2.9110 7.0174 6.6415 1.0890 1.0963 1.0944 1.0979 1.0662
irintensity: 3.0721 0.6432 1.8767 46.2871 8.3762 12.4912 4.3971 67.7655 9.8207 16.6313 61.8300 5.5630 3.5286 8.7676 109.7858 44.7434 23.7858 19.3040 63.4969 70.6536 8.7273 33.2107 0.4714 11.9188 56.2477 48.2704 52.0032 35.9213 8.5322 12.3024 50.7229 26.5563 24.6487 73.0867 4.3770 19.9429 28.8808 4.0925 9.2500 19.5017 0.4230 55.6448
temp: 298.150 k
press: 1.00000 atm
elementType: 16 8 8 8 8 7 6 6 6 6 6 1 1 1 1 1
symmnumber: 1
zpe: 262659.6 jmol-1
zpe.correction: 0.100042 hartree
zpe.thermalcorrener: 0.110856 hartree
zpe.thermalcorrenthalpy: 0.111800 hartree
zpe.thermalcorrgfe: 0.062752 hartree
zpe.sumelectzpe: -946.175078 hartree
zpe.sumelectthermal: -946.164264 hartree
zpe.sumelectthermalent: -946.163320 hartree
zpe.sumelectthermalfe: -946.212368 hartree
dipole: 1.0462 3.5502 1.5187
dipole: 4.0007
quadrupole: -73.9071 -72.0710 -74.1850
quadrupole: 13.3478 -7.9802 -1.3649
quadrupole: -0.5194 1.3167 -0.7973 13.3478 -7.9802 -1.3649
hfenergy: -946.2751197 hartree
pointgroup: C01 [X(C5H5N1O4S1)]
dipole: -0.4403044 -1.4220079 0.511315 debye
dipolederiv: 1.8645198 0.0488768 0.0723227 0.1495317 1.2308498 0.0025648 0.1492065 0.0144142 1.6464885 -0.5114255 0.042027 -0.2273977 0.0155123 -0.5313746 -0.0351104 -0.310522 -0.0275925 -0.9912048 -0.7154014 0.0379472 0.0399999 0.0629285 -0.5449843 -0.1065193 0.0382359 -0.0303188 -0.5027043 -0.6458923 -0.0371765 -0.0026981 -0.1132373 -0.5804501 0.1107779 0.0117319 0.0243678 -0.4952503 -0.7397872 0.3782912 0.0156003 0.4817781 -0.7159548 -0.020034 0.0249584 -0.0219081 -0.2990458 0.667037 -0.6003935 -0.0273807 -0.5607515 0.6558124 0.0269018 -0.0446644 0.0294686 0.1364912 0.0990736 -0.0725006 0.0159816 0.0662883 0.1604557 0.0116999 0.1415281 0.0321036 -0.1004397 -0.3816746 0.375278 0.0099383 -0.3040872 -0.0739979 0.0036898 -0.0150682 -0.0172362 -0.0739131 -0.3983804 -0.1443376 -0.0141519 0.1180427 -0.2125924 -0.0086939 -0.0043018 0.0095879 -0.1209493 0.1638007 0.1074229 0.0009209 -0.152947 0.1399263 0.0099006 -0.0237653 0.0057868 -0.0676321 0.1524173 -0.0648613 -0.0078815 0.2880274 -0.2028127 -0.0074638 0.0106543 -0.0026823 -0.1200642 0.1088715 0.0068004 0.0100928 0.0127552 0.1324525 -0.002062 0.0104093 0.0055446 0.1841392 0.1097356 0.0465523 0.0113151 0.0216244 0.1168689 0.0015595 0.0088734 -0.0114685 0.1750871 0.0532062 -0.0575339 -0.0019488 -0.0666569 -0.0036812 -0.0074927 0.0013808 -0.0071103 0.1616887 0.0454902 -0.0099165 0.0012071 0.0324865 0.0855726 -0.0046826 0.0045027 -0.0047151 0.1883766 0.1284095 -0.0564757 0.10408 -0.0512953 0.3439099 0.0249644 -0.0031596 0.0017583 0.2789323 unknown
polarizability: 137.4147287|-8.9187184|112.5151651|-0.337622|2.6909726|58.2040883 unknown
InChI: InChI=1S/C5H5NO4S/c7-6-3-1-2-5(4-6)11(8,9)10/h1-4,8H
charge 0 multiplicity 1
16 atoms
S  2.028792 0.095937 -0.076676
O  2.216892 0.079703 1.767629
O  2.808994 -1.173514 -0.703284
O  2.302269 1.593024 -0.620969
O  -2.897972 1.632933 0.08995
N  -2.053713 0.615086 0.033183
C  0.180357 -0.260634 -0.036439
C  -0.671934 0.837535 0.01785
C  -0.2406 -1.59779 -0.091335
C  -1.644493 -1.791069 -0.079929
C  -2.52253 -0.704497 -0.016525
H  -0.354114 1.880584 0.043295
H  0.472332 -2.423113 -0.151039
H  -2.066711 -2.798616 -0.119625
H  -3.609758 -0.789152 -0.003243
H  3.17229 0.29008 1.983357
