program: Gaussian 09
title: 000222047
version: EM64L-G09RevD.01
frameworkgroup: C1[X(C17H29NO2)]
method: RPBEPBE
basis: SDD
operation: Freq
keyword: #p
keyword: freq=noraman
keyword: PBEPBE/SDD
title: #p freq=noraman PBEPBE/SDD
converged: YES YES NO NO
title: Mulliken charges:
elementType: O O N C C C C C C C C C C C C C C C C C H H H H H H H H H H H H H H H H H H H H H H H H H H H H H
charge: -0.264225 -0.249142 -0.076220 -0.135373 -0.190539 -0.486416 -0.439987 -0.461685 -0.239535 -0.434917 -0.441473 -0.439049 -0.445271 -0.330386 -0.350690 0.211177 -0.245118 -0.319041 -0.358026 -0.699126 0.241734 0.249637 0.222731 0.230470 0.218728 0.207330 0.216359 0.214834 0.232123 0.233426 0.215033 0.229889 0.236387 0.220165 0.229690 0.217225 0.222396 0.218720 0.214327 0.199962 0.191995 0.228385 0.234577 0.238272 0.200557 0.193157 0.216738 0.210563 0.209632
chargesum: 0.00000
title: Mulliken charges with hydrogens summed into heavy atoms:
elementType: O O N C C C C C C C C C C C C C C C C C
charge: -0.264225 -0.249142 -0.076220 0.106361 0.059098 -0.033216 -0.013929 -0.030492 -0.003148 0.030632 0.003449 0.010807 -0.005650 0.102661 0.041268 0.211177 -0.016734 0.153807 0.035687 -0.062193
polarizability: 2.32374387e+02 -1.05215108e+01 1.92898419e+02 -2.32107482e+00 3.72350490e+00 1.54649147e+02
1716.lowfreq: -23.6239 -12.6446 -2.3961 -0.0006 -0.0005 0.0005 7.4830 14.5424 22.7568
frequency: -19.7002 12.6443 22.5937 41.5681 44.1769 48.8709 61.8334 66.1617 68.0333 97.4576 107.6892 111.8911 126.6650 137.6417 190.7197 215.1491 232.7670 243.9379 258.7873 273.4200 296.8804 314.8118 361.9569 394.6416 421.1607 451.8036 485.4438 504.2971 605.6658 615.9654 646.9664 659.5875 706.9816 727.7373 729.6752 762.4719 764.9453 774.2839 805.2184 821.7677 832.5907 844.0572 857.1620 869.7553 878.7155 901.7558 905.9653 914.4153 921.6776 936.7673 942.5012 948.8094 978.7516 1010.8590 1017.3167 1021.5181 1038.8271 1049.1481 1054.5370 1062.9100 1077.4033 1077.9947 1078.8571 1081.3679 1099.9836 1109.1137 1116.4648 1123.3686 1151.4252 1161.4481 1170.9855 1197.0605 1197.5741 1206.4007 1216.8069 1226.0707 1240.4840 1260.2492 1262.9041 1266.7608 1281.3044 1285.7549 1287.5018 1290.7704 1292.7763 1292.9903 1296.7859 1308.6873 1310.5923 1318.1883 1329.3987 1331.2275 1335.1952 1350.7303 1355.6452 1374.4605 1388.9589 1446.3845 1455.8488 1462.9811 1463.7347 1464.9332 1468.0480 1471.1202 1474.8505 1477.2321 1477.5231 1479.6296 1485.8279 1489.4475 1624.0704 1630.1514 2902.5497 2948.4327 2954.7642 2966.0535 2968.3547 2971.6737 2981.9025 2983.6065 2995.5413 2996.9950 2998.4910 3003.2516 3018.5957 3019.0579 3024.5202 3027.1453 3037.1689 3044.0184 3050.5678 3055.6509 3068.2970 3069.2628 3070.6950 3071.4161 3075.0518 3090.0697 3128.1125 3133.2364 3167.1540
redmass: 3.6929 3.6109 3.8187 3.4292 3.4183 1.8022 2.7534 2.4023 2.8394 2.7075 2.8786 3.2222 2.1674 3.4238 3.2079 2.3973 1.3982 2.6099 3.2423 3.5519 2.7199 3.9619 2.2977 2.7119 2.5460 3.5505 2.8698 3.2930 2.1521 2.3159 3.1617 3.7060 4.0508 1.2878 1.3034 1.6009 1.5802 4.2892 1.2980 2.1414 1.5929 1.9825 2.0476 2.2846 3.5598 1.8887 3.0647 3.1329 2.6999 1.5477 1.3409 1.4018 2.5128 3.5984 1.9010 2.8037 2.7236 2.4311 2.3868 2.3109 2.0864 2.2857 2.1548 1.8027 2.3670 1.5472 1.6204 1.9449 2.1099 1.7581 1.2807 1.2871 1.2199 1.4492 1.2599 1.3066 1.3048 1.3066 1.3288 1.3069 1.2647 1.3727 1.2847 1.1371 1.1383 1.3137 1.3223 1.2598 1.2164 1.3062 1.4538 1.4006 1.5035 1.6696 1.5984 1.3598 1.2163 1.0920 1.0775 1.0874 1.0779 1.0830 1.0833 1.0836 1.0711 1.0939 1.0432 1.0872 1.0772 1.0927 8.3983 6.5547 1.0688 1.0823 1.0585 1.0593 1.0636 1.0362 1.0593 1.0657 1.0984 1.0627 1.0659 1.0597 1.0929 1.0646 1.0950 1.0942 1.0670 1.0837 1.1024 1.1013 1.1008 1.1007 1.1024 1.0993 1.1026 1.1060 1.1073 1.0854 1.1063
irintensity: 0.5222 0.2126 0.4383 0.0731 0.4004 0.1134 0.7850 0.3005 0.1563 0.4585 0.1443 1.0586 0.0348 0.8873 0.8516 0.5763 0.1453 1.5978 4.7120 2.3708 1.2620 13.2173 1.0070 4.0786 4.4248 15.7618 4.8969 4.4316 3.2692 16.5689 9.0473 2.5551 3.7634 39.7172 10.7425 8.8931 10.7003 1.4256 1.4340 2.7820 2.0067 8.0637 10.3478 10.8846 11.0145 8.8148 13.2456 7.9272 9.2614 10.8166 7.4831 15.2826 20.0170 6.5468 7.6703 13.8537 14.7175 11.0093 26.7378 3.9930 21.0204 78.7101 18.1071 2.1649 112.4497 23.0264 75.3347 22.3383 4.9106 8.2652 2.2412 2.3741 2.4687 0.5456 4.8711 19.2100 7.3317 9.9440 10.5477 2.2097 8.2309 5.4864 3.5866 3.9405 3.9085 0.3978 3.1217 3.8709 2.1144 3.3817 2.0656 3.5592 26.7806 14.2111 4.0245 11.9361 10.6836 5.1018 3.7513 7.2758 3.5473 7.3938 4.6231 15.7740 6.0490 8.7877 11.8480 3.7632 15.8917 8.3381 105.0017 7.0080 73.8754 14.2851 6.0776 43.3572 58.3313 33.9191 56.3257 52.2297 0.8963 29.3325 19.5720 48.0943 10.4009 50.2242 12.2463 34.8264 24.3955 13.0866 38.2541 18.9414 85.4725 8.6029 44.2174 54.8514 20.6670 102.3295 15.7906 7.3823 33.3392
temp: 298.150 k
press: 1.00000 atm
elementType: 8 8 7 6 6 6 6 6 6 6 6 6 6 6 6 6 6 6 6 6 1 1 1 1 1 1 1 1 1 1 1 1 1 1 1 1 1 1 1 1 1 1 1 1 1 1 1 1 1
symmnumber: 1
zpe: 1131364.8 jmol-1
zpe.correction: 0.430914 hartree
zpe.thermalcorrener: 0.452450 hartree
zpe.thermalcorrenthalpy: 0.453394 hartree
zpe.thermalcorrgfe: 0.376427 hartree
zpe.sumelectzpe: -868.778329 hartree
zpe.sumelectthermal: -868.756793 hartree
zpe.sumelectthermalent: -868.755849 hartree
zpe.sumelectthermalfe: -868.832816 hartree
dipole: -0.4616 0.8296 -0.8901
dipole: 1.3013
quadrupole: -111.5354 -121.7788 -127.1852
quadrupole: -1.7777 -0.9376 -0.6678
quadrupole: 8.6310 -1.6123 -7.0187 -1.7777 -0.9376 -0.6678
hfenergy: -869.2092431 hartree
pointgroup: C01 [X(C17H29N1O2)]
dipole: -0.1202525 -0.2714621 0.4171065 debye
polarizability: 226.1523671|17.9521672|198.8099375|-0.2076282|-5.3150132|154.9596485 unknown
InChI: InChI=1S/C17H29NO2/c1-2-3-10-16(15-8-4-5-9-15)17(19)20-14-13-18-11-6-7-12-18/h4,8,15-16H,2-3,5-7,9-14H2,1H3
charge 0 multiplicity 1
49 atoms
O  -0.202739 1.196248 0.729516
O  0.053412 0.249451 -1.388555
N  -3.915646 0.701242 0.210806
C  2.942019 1.096181 -0.614551
C  1.944157 0.210519 0.205887
C  2.670493 2.634037 -0.477768
C  2.22047 -1.30784 0.031478
C  4.070993 3.324142 -0.460257
C  4.398231 0.975339 -0.173299
C  -4.124558 0.339567 -1.227453
C  -5.021132 -0.006304 0.9178
C  -4.738174 -1.111712 -1.25344
C  -5.143281 -1.400954 0.227614
C  -2.553923 0.373728 0.705234
C  1.302379 -2.211453 0.885013
C  0.52676 0.525411 -0.258848
C  5.010862 2.184764 -0.091112
C  -1.613038 1.549941 0.383384
C  1.631357 -3.713402 0.727638
C  0.715817 -4.621377 1.576603
H  2.844424 0.780907 -1.676422
H  2.022654 0.487631 1.273775
H  2.020018 3.014925 -1.284113
H  2.152955 2.823325 0.481783
H  2.104949 -1.567474 -1.039738
H  3.274345 -1.508407 0.304378
H  4.338524 3.737944 -1.454618
H  4.117598 4.167298 0.254705
H  -3.172356 0.40564 -1.780989
H  -4.832682 1.059722 -1.677438
H  -5.955887 0.568955 0.768422
H  -4.824375 -0.058224 2.002053
H  4.891114 0.013147 0.001021
H  -5.614381 -1.148923 -1.924813
H  -4.009072 -1.853496 -1.62259
H  -6.158663 -1.825947 0.314898
H  -4.438785 -2.115472 0.691712
H  -2.132144 -0.557447 0.259432
H  -2.594633 0.230372 1.8000
H  0.242891 -2.043662 0.600539
H  1.389476 -1.925918 1.954054
H  6.064375 2.34026 0.166629
H  -1.665596 1.809788 -0.687928
H  -1.846085 2.428659 1.002547
H  1.543852 -3.993729 -0.341814
H  2.690421 -3.886554 1.009147
H  0.967932 -5.689521 1.443623
H  0.808614 -4.383279 2.653189
H  -0.345643 -4.487149 1.294366
