program: Gaussian 09
title: 000222024
version: EM64L-G09RevD.01
frameworkgroup: C1[X(C11H21N)]
method: RPBEPBE
basis: SDD
operation: Freq
keyword: #pfreq=noraman
keyword: PBEPBE/SDD
title: #p freq=noraman PBEPBE/SDD
converged: YES YES NO NO
title: Mulliken charges:
elementType: N C C C C C C C C C C C H H H H H H H H H H H H H H H H H H H H H
charge: -0.287391 -0.000004 -0.124488 -0.425904 -0.461375 -0.395443 -0.384538 -0.466274 -0.268983 -0.210507 -0.713190 -0.724983 0.173800 0.217637 0.182270 0.203122 0.209860 0.219481 0.233576 0.201375 0.190390 0.196125 0.225916 0.214374 0.219014 0.252081 0.229056 0.212841 0.209057 0.223417 0.219984 0.216128 0.213573
chargesum: 0.00000
title: Mulliken charges with hydrogens summed into heavy atoms:
elementType: N C C C C C C C C C C C
charge: -0.053815 0.173796 0.093149 -0.040512 -0.032034 -0.003677 0.037503 -0.032886 -0.016902 0.018548 -0.067874 -0.075297
polarizability: 1.57381064e+02 -2.60663900e+00 1.15590753e+02 -2.68649873e+00 -3.25172166e+00 9.90044359e+01
1716.lowfreq: -11.5771 -0.0005 -0.0002 -0.0002 6.4866 15.3619 38.2306 40.9101 58.0981
frequency: 37.8588 40.5041 57.8171 73.9022 89.2310 126.7884 148.6715 210.2504 214.7427 241.5140 247.6739 279.0292 306.3365 348.6801 411.9180 471.8063 516.2443 533.8153 614.7462 678.7464 739.0924 743.2368 765.5649 769.1875 813.9266 824.8945 858.0137 901.2771 918.1211 952.8439 959.1394 972.1808 984.8511 1005.5337 1012.8361 1028.3965 1041.7208 1059.2810 1068.2642 1098.1372 1124.1491 1134.0539 1152.0548 1158.8472 1171.6005 1192.4980 1209.5541 1248.1083 1253.3901 1260.9453 1279.2374 1282.1171 1287.4771 1303.8612 1329.3009 1341.7597 1350.3637 1357.9180 1373.2534 1389.0765 1390.9874 1445.7427 1460.2064 1462.0095 1467.7810 1475.7159 1478.0885 1482.0220 1483.9422 1491.1500 1492.2388 1636.4761 2852.4059 2920.2607 2951.2866 2964.7049 2971.5460 2974.1502 2976.2559 2986.9798 2992.6864 2995.0788 3013.0379 3020.3674 3034.5216 3065.9668 3067.0234 3067.9439 3071.2818 3075.1601 3138.4581 3175.1790 3412.2660
redmass: 3.0635 3.1178 2.7053 2.5091 2.4170 1.7909 2.0006 1.8989 1.4045 1.6944 2.1993 2.2639 2.1343 2.4890 2.8899 2.6135 1.9608 2.1977 2.6969 1.5073 1.4611 1.6577 1.8809 2.0459 1.4294 1.5474 2.1938 1.7355 2.5405 1.2776 1.6991 2.0336 2.0383 1.3995 1.9663 1.6853 2.2020 2.2038 2.1129 1.1996 1.5479 2.3755 1.8357 2.0271 2.4198 1.2923 1.3130 1.2825 1.2711 1.3964 1.0991 1.1925 1.5044 1.2870 1.4954 1.6593 1.4540 1.3914 1.4423 1.2352 1.2111 1.2075 1.0848 1.0642 1.0708 1.0943 1.0537 1.0555 1.0466 1.0671 1.0705 6.3761 1.0714 1.0811 1.0832 1.0588 1.0603 1.0373 1.0364 1.0621 1.0686 1.0858 1.0991 1.0966 1.0994 1.0993 1.1019 1.0984 1.1002 1.0996 1.0863 1.1066 1.0738
irintensity: 0.3614 0.0170 0.0810 0.3867 0.0379 0.1919 1.4299 0.8358 0.1247 0.7458 0.4409 0.8359 0.2039 3.8183 0.9731 0.6444 1.5217 7.5031 16.3428 84.2312 59.0435 0.6930 8.9543 7.4600 7.1176 1.0539 6.8701 11.0050 12.4024 3.1376 3.9962 4.5326 1.0450 4.6529 1.1464 10.9657 5.0905 15.1014 5.0651 0.8324 4.4064 51.4623 10.9824 13.0159 15.9495 2.0827 2.0142 0.3510 1.3395 2.3969 0.9181 8.0854 3.5011 1.8757 0.3559 18.2408 0.4824 0.0706 3.2923 17.1230 13.4572 35.4962 4.9572 5.3580 8.9508 9.8057 19.2992 6.5639 1.5802 8.9784 10.9995 3.1037 90.0873 30.6602 30.5423 43.4812 58.7131 25.1648 31.7673 40.3269 28.3051 30.0000 53.5722 34.6551 7.0955 39.4650 46.7470 74.7173 76.0440 46.1795 9.3525 25.0451 1.2274
temp: 298.150 k
press: 1.00000 atm
elementType: 7 6 6 6 6 6 6 6 6 6 6 6 1 1 1 1 1 1 1 1 1 1 1 1 1 1 1 1 1 1 1 1 1
symmnumber: 1
zpe: 782712.2 jmol-1
zpe.correction: 0.298119 hartree
zpe.thermalcorrener: 0.312293 hartree
zpe.thermalcorrenthalpy: 0.313238 hartree
zpe.thermalcorrgfe: 0.256084 hartree
zpe.sumelectzpe: -485.504125 hartree
zpe.sumelectthermal: -485.489951 hartree
zpe.sumelectthermalent: -485.489006 hartree
zpe.sumelectthermalfe: -485.546160 hartree
dipole: 0.4591 -1.1850 0.0294
dipole: 1.2711
quadrupole: -74.6427 -77.1959 -75.6944
quadrupole: -0.9285 -0.2117 0.1419
quadrupole: 1.2017 -1.3516 0.1499 -0.9285 -0.2117 0.1419
hfenergy: -485.802244 hartree
pointgroup: C01 [X(C11H21N1)]
dipole: 0.1711933 0.4698452 -0.0061784 debye
polarizability: 157.2188176|3.4453347|115.7697642|3.1707532|-3.0223249|98.9876708 unknown
InChI: InChI=1S/C11H21N/c1-3-10(4-2)9-12-11-7-5-6-8-11/h5,7,10-12H,3-4,6,8-9H2,1-2H3
charge 0 multiplicity 1
33 atoms
N  0.458053 -0.200857 0.342911
C  -2.008705 0.262068 0.374009
C  1.76846 -0.175296 -0.34429
C  -0.656515 0.473289 -0.357265
C  2.493424 1.227254 -0.438075
C  -3.103965 1.153803 -0.271714
C  -2.39292 -1.242141 0.466759
C  3.997514 0.973349 -0.097221
C  2.797113 -1.042733 0.37105
C  3.995117 -0.421438 0.514839
C  -4.468391 1.102283 0.44886
C  -2.759569 -1.915628 -0.875365
H  -1.873373 0.621606 1.420908
H  1.585318 -0.576718 -1.364195
H  -0.493859 1.57421 -0.48108
H  -0.715512 0.050468 -1.380746
H  2.041888 1.903066 0.31416
H  2.365397 1.702646 -1.426234
H  0.546157 0.120817 1.318525
H  -3.236454 0.86601 -1.33457
H  -2.740811 2.202432 -0.28209
H  -3.239645 -1.356058 1.172329
H  -1.530558 -1.775427 0.909786
H  4.416434 1.734969 0.588477
H  4.628295 0.993896 -1.009324
H  2.550412 -2.057705 0.697786
H  4.882875 -0.863522 0.980648
H  -5.18557 1.809571 -0.007288
H  -4.363164 1.370565 1.517554
H  -4.916606 0.09341 0.399604
H  -1.924084 -1.865051 -1.597569
H  -3.645325 -1.45037 -1.346936
H  -2.991728 -2.985172 -0.717944
