program: Gaussian 09
title: 000222012
version: EM64L-G09RevD.01
frameworkgroup: C1[X(C15H14BrNO2)]
method: RPBEPBE
basis: SDD
operation: Freq
keyword: #p
keyword: freq=noraman
keyword: PBEPBE/SDD
title: #p freq=noraman PBEPBE/SDD
converged: YES YES NO NO
title: Mulliken charges:
elementType: Br O O N C C C C C C C C C C C C C C C H H H H H H H H H H H H H H
charge: -0.004416 -0.365251 -0.284566 -0.485002 0.047008 0.313134 0.135790 0.479011 -0.297624 -0.351832 -0.249765 -0.227701 -0.229718 -0.336214 -0.440646 -0.165862 -0.153791 -0.236678 -0.693524 0.284036 0.385098 0.245700 0.236142 0.231516 0.220602 0.220508 0.317211 0.227361 0.247388 0.245761 0.230775 0.231199 0.224350
chargesum: 0.00000
title: Mulliken charges with hydrogens summed into heavy atoms:
elementType: Br O O N C C C C C C C C C C C C C C C
charge: -0.004416 -0.365251 -0.284566 -0.099904 0.047008 0.313134 0.135790 0.479011 -0.013588 -0.106132 -0.013623 0.003815 0.211392 -0.019002 -0.213285 0.081526 0.091970 -0.236678 -0.007201
polarizability: 3.51707007e+02 -1.89154961e+01 2.02751149e+02 7.06451033e-02 -3.90589623e-02 8.00312126e+01
1716.lowfreq: -8.7391 -3.3253 -2.2940 -0.0004 0.0001 0.0005 21.8814 34.7928 53.3779
frequency: 21.2298 34.7183 53.3773 59.6215 77.1109 101.0827 120.0312 131.5619 162.7709 165.7152 204.3280 247.4987 264.6351 278.9394 311.8808 331.3179 360.7160 373.3867 381.2351 411.3164 439.9102 506.9442 511.6796 530.3480 596.6836 612.2653 627.8955 667.2792 673.3220 708.0816 752.5283 769.1313 771.2257 798.0068 820.4439 826.1287 840.1845 851.3292 860.5812 867.5885 908.0587 942.6522 964.6552 988.0564 989.4837 1001.5811 1033.8250 1043.2547 1060.3359 1077.7809 1111.8236 1115.5540 1126.7645 1137.5740 1172.1650 1184.8301 1197.7630 1230.9838 1261.1300 1278.1075 1281.2846 1296.8827 1359.5322 1364.7376 1383.4796 1397.2029 1399.9956 1432.8783 1465.5904 1465.8781 1476.4578 1481.1849 1490.8223 1531.4944 1570.1948 1589.2001 1598.4092 1605.6379 1630.1568 2973.5888 2994.3784 3036.0415 3094.1357 3100.6521 3124.0023 3136.9239 3151.2293 3163.5553 3165.6203 3167.3687 3175.8801 3195.0208 3344.4886
redmass: 5.3161 4.5962 5.6273 3.7910 7.0595 2.3612 4.9532 3.3890 8.3318 6.1529 6.3975 1.3757 3.0266 5.1405 5.3949 5.6554 4.2043 7.8472 6.3372 3.0085 3.5652 6.0040 2.9222 3.5302 6.8328 6.8237 7.0969 6.3022 4.1962 3.3966 2.7811 1.4867 4.6979 1.3227 5.6181 1.1263 1.2173 1.4427 6.4134 1.4232 3.3843 1.3605 1.3521 5.0160 1.3179 1.3360 2.9106 2.6511 2.5316 3.3769 2.0352 1.5124 1.7712 1.4279 1.1793 1.1143 2.7076 2.6205 1.1420 1.8022 1.8030 1.4920 1.7572 3.0898 4.8410 1.3320 3.9890 2.3760 2.0250 1.0412 2.4307 1.1126 1.1662 3.1039 7.0295 6.4350 5.6694 4.8819 2.5964 1.0556 1.0360 1.1081 1.0988 1.1022 1.0895 1.0862 1.0900 1.0912 1.0941 1.0952 1.0992 1.0952 1.0804
irintensity: 0.8122 0.0474 0.4956 0.0196 4.8551 0.3751 0.4561 3.4419 0.5206 0.6538 1.1395 0.5245 0.3546 6.9486 18.3057 0.3478 1.5830 19.8075 1.1102 0.0285 0.0540 1.5554 39.4974 0.4331 4.3149 1.5330 0.0020 20.7953 7.5452 0.5045 24.9636 67.7986 2.8848 1.1292 30.9328 3.2287 72.7398 84.6277 4.9707 0.0220 32.1798 2.4416 1.8229 42.2504 3.8273 1.0302 59.8485 36.3281 23.9920 49.7153 13.2661 3.3681 34.9488 4.6129 38.5020 3.0397 103.3580 32.1417 0.0020 93.2976 3.5777 43.8828 12.4408 85.8957 7.8652 21.8845 15.3895 41.6942 48.8749 14.4424 197.9077 13.0186 21.4469 476.4593 25.6593 82.0037 79.4970 31.2031 146.1096 44.3379 13.0817 21.2467 35.5473 34.3336 15.2188 3.3069 5.0640 5.7296 16.6214 3.6171 26.7860 10.6054 278.7182
temp: 298.150 k
press: 1.00000 atm
elementType: 35 8 8 7 6 6 6 6 6 6 6 6 6 6 6 6 6 6 6 1 1 1 1 1 1 1 1 1 1 1 1 1 1
symmnumber: 1
zpe: 667482.2 jmol-1
zpe.correction: 0.254231 hartree
zpe.thermalcorrener: 0.271804 hartree
zpe.thermalcorrenthalpy: 0.272748 hartree
zpe.thermalcorrgfe: 0.206070 hartree
zpe.sumelectzpe: -797.316570 hartree
zpe.sumelectthermal: -797.298997 hartree
zpe.sumelectthermalent: -797.298052 hartree
zpe.sumelectthermalfe: -797.364730 hartree
dipole: 5.7451 5.3930 0.0210
dipole: 7.8798
quadrupole: -107.8250 -108.0906 -126.5525
quadrupole: 10.6343 0.0555 -0.0079
quadrupole: 6.3310 6.0654 -12.3965 10.6343 0.0555 -0.0079
hfenergy: -797.5708005 hartree
pointgroup: C01 [X(C15H14Br1N1O2)]
dipole: -2.1345874 -2.2436302 0.1435426 debye
polarizability: 353.3786626|-10.3052879|200.7060268|-0.778613|-6.6534249|80.4046793 unknown
InChI: InChI=1S/C15H14BrNO2/c1-2-19-14-6-4-3-5-13(14)15(18)17-12-9-7-11(16)8-10-12/h3-10,17H,2H2,1H3
charge 0 multiplicity 1
33 atoms
Br 6.6125 0.339408 -0.002342
O  -1.569519 -1.534405 0.131087
O  -0.196039 2.496139 -0.096049
N  0.408275 0.232124 0.032774
C  -1.979088 0.858826 0.007668
C  -2.499995 -0.471801 0.082288
C  -0.5207 1.266741 -0.023283
C  1.821153 0.325844 0.019987
C  -2.910842 1.927352 -0.044546
C  -3.896302 -0.703021 0.103321
C  -4.301246 1.70795 -0.02358
C  -4.79262 0.385799 0.050835
C  -2.060048 -2.927197 0.219737
C  2.532785 1.555625 -0.053307
C  2.551309 -0.894511 0.085338
C  3.944288 1.55271 -0.05947
C  3.959681 -0.897887 0.078568
C  4.645517 0.332514 0.006352
C  -0.831195 -3.831597 0.267339
H  -2.489694 2.936482 -0.102263
H  -0.002576 -0.712966 0.089782
H  -4.292571 -1.72018 0.159033
H  -4.992839 2.555092 -0.064184
H  -5.871273 0.194939 0.067575
H  -2.675769 -3.03392 1.134393
H  -2.687179 -3.144471 -0.667186
H  1.974477 2.491679 -0.10478
H  2.014259 -1.849503 0.141894
H  4.486829 2.500982 -0.115493
H  4.50998 -1.84175 0.129013
H  -0.207762 -3.604029 1.149451
H  -0.219453 -3.714741 -0.644026
H  -1.149044 -4.887422 0.334577
