program: Gaussian 09
title: 000222004
version: EM64L-G09RevD.01
frameworkgroup: C1[X(C13H19NO)]
method: RPBEPBE
basis: SDD
operation: Freq
keyword: #p
keyword: freq=noraman
keyword: PBEPBE/SDD
title: #p freq=noraman PBEPBE/SDD
converged: YES YES NO NO
title: Mulliken charges:
elementType: O N C C C C C C C C C C C C C H H H H H H H H H H H H H H H H H H H
charge: -0.272334 -0.376732 -0.361695 -0.336368 -0.541280 -0.356306 0.252785 -0.520814 -0.694013 0.487483 -0.443920 -0.368196 -0.217448 -0.226054 -0.241356 0.197090 0.237197 0.185349 0.182872 0.204391 0.228678 0.200438 0.195190 0.224351 0.266433 0.217030 0.210102 0.208102 0.297278 0.231182 0.247840 0.226468 0.226803 0.229453
chargesum: 0.00000
title: Mulliken charges with hydrogens summed into heavy atoms:
elementType: O N C C C C C C C C C C C C C
charge: -0.272334 -0.079454 0.072592 0.031853 -0.108211 0.039322 0.252785 -0.030031 -0.058779 0.487483 -0.212737 -0.120356 0.009020 0.000749 -0.011902
polarizability: 2.06302613e+02 5.19237123e+00 1.30846461e+02 -1.69631839e+01 1.02184663e+01 1.11126176e+02
1716.lowfreq: -17.1511 -9.4885 -4.5322 -1.1387 -0.0007 -0.0004 0.0004 19.0439 28.4283
frequency: -13.2879 18.7210 28.2711 44.9165 48.8053 94.3659 102.3971 127.2515 176.4540 200.5474 223.1210 234.6645 272.8083 296.4726 358.5467 401.6017 403.1697 450.7638 499.7921 561.0353 603.1198 609.7028 618.5265 699.6233 705.1438 726.2863 752.6849 757.7082 807.9612 838.4936 853.9167 869.7968 902.1738 917.6602 953.2820 976.9170 990.1250 995.0293 999.0151 1013.3897 1026.2823 1043.4975 1067.1636 1077.5002 1087.2029 1109.3262 1115.9145 1172.0880 1187.0854 1192.5846 1212.9618 1213.8775 1233.1741 1241.5297 1264.2705 1284.3466 1290.5268 1309.1801 1321.6900 1343.4271 1352.8653 1355.1563 1386.0347 1389.2130 1441.0413 1445.5299 1464.6370 1467.4561 1469.8988 1477.9635 1479.3447 1480.5529 1486.2648 1487.8648 1595.1284 1613.0906 1615.6227 2949.6694 2968.6817 2969.6656 2971.3564 2981.4555 2983.2010 2993.4071 3020.4404 3025.7927 3041.3937 3058.2209 3068.3174 3071.2929 3114.5252 3123.5298 3135.4599 3146.0950 3163.3249 3550.7208
redmass: 2.6633 4.0550 5.3439 4.2297 2.2063 2.7526 2.7766 1.9862 3.9687 4.0995 4.4454 1.1126 3.2633 3.4690 2.8337 2.9825 2.8291 2.9033 3.7664 1.7755 3.1581 2.2842 4.4061 4.0473 1.7996 1.0761 1.5027 1.3864 3.8619 1.3081 1.2493 2.6985 1.8813 1.4644 1.2672 1.3937 6.0051 1.3533 3.4188 2.5673 2.2158 3.2092 2.2366 2.3087 1.5591 1.8866 2.2973 1.0539 1.1370 1.6348 2.4553 1.4375 1.3133 1.3539 1.2974 1.0684 1.1733 1.3142 1.3494 1.4300 1.5633 1.5910 5.8907 1.2165 2.1463 1.1017 1.0687 1.2110 1.0734 1.0424 1.9687 1.0704 1.9006 1.0888 6.0764 6.2479 6.0510 1.0589 1.0581 1.0573 1.0393 1.0663 1.0612 1.0936 1.0984 1.1030 1.1004 1.1030 1.1010 1.0992 1.0873 1.0860 1.0913 1.0962 1.1015 1.0778
irintensity: 0.8086 0.6162 2.4518 2.0495 1.0476 2.4679 1.8719 0.3835 1.0998 3.2238 6.7602 0.0259 7.1797 4.3915 2.3823 8.5616 0.4584 5.1477 13.4980 52.1038 46.3187 28.2805 4.4990 0.8161 50.3219 10.6176 36.0894 13.2476 7.2796 3.9364 0.0821 9.1607 0.6988 3.3955 1.5941 0.1445 0.0821 1.4474 4.5621 4.9252 12.2000 0.9244 0.7969 1.3373 21.4431 19.4057 1.8417 0.1222 4.7151 17.3986 3.7220 9.8243 77.2001 40.7208 14.9880 0.7910 2.1586 4.3442 18.8745 4.1913 0.7916 13.9201 3.9449 11.0638 26.1502 10.1845 1.0695 66.6970 0.5117 12.5841 143.1569 3.9432 67.9059 22.6153 0.5913 111.4315 56.9405 15.3360 49.8168 8.0099 30.8876 41.3969 53.0074 13.3987 22.9038 3.2755 14.0034 28.5600 113.8356 54.3618 9.1578 0.9275 13.3384 41.0679 22.6814 15.1661
temp: 298.150 k
press: 1.00000 atm
elementType: 8 7 6 6 6 6 6 6 6 6 6 6 6 6 6 1 1 1 1 1 1 1 1 1 1 1 1 1 1 1 1 1 1 1
symmnumber: 1
zpe: 767237.6 jmol-1
zpe.correction: 0.292225 hartree
zpe.thermalcorrener: 0.307444 hartree
zpe.thermalcorrenthalpy: 0.308388 hartree
zpe.thermalcorrgfe: 0.246973 hartree
zpe.sumelectzpe: -635.630735 hartree
zpe.sumelectthermal: -635.615516 hartree
zpe.sumelectthermalent: -635.614572 hartree
zpe.sumelectthermalfe: -635.675988 hartree
dipole: 0.7072 1.0093 -3.4397
dipole: 3.6538
quadrupole: -83.4402 -88.2919 -96.3280
quadrupole: -0.7527 -1.0452 6.3235
quadrupole: 5.9131 1.0615 -6.9746 -0.7527 -1.0452 6.3235
hfenergy: -635.9229602 hartree
pointgroup: C01 [X(C13H19N1O1)]
dipole: 0.2328228 -0.0349548 1.4180884 debye
polarizability: 205.0639376|-0.4527325|134.6133368|20.8586212|4.0486386|108.5979759 unknown
InChI: InChI=1S/C13H19NO/c1-2-3-5-10-13(15)14-11-12-8-6-4-7-9-12/h4,6-9,14H,2-3,5,10-11H2,1H3
charge 0 multiplicity 1
34 atoms
O  -0.769811 0.397691 -1.801905
N  0.27812 0.692693 0.255185
C  -3.331147 0.250852 -0.286779
C  -4.544852 -0.467647 0.341294
C  -1.980384 -0.310522 0.217807
C  -5.89825 0.086771 -0.159774
C  -0.789155 0.288741 -0.536467
C  1.517315 1.253105 -0.311558
C  -7.111903 -0.634121 0.465634
C  2.757874 0.438642 0.040758
C  3.892676 1.062022 0.61487
C  2.800834 -0.955125 -0.223061
C  5.052406 0.311096 0.918399
C  3.955976 -1.707349 0.080086
C  5.0869 -1.076325 0.652405
H  -3.385224 1.33626 -0.066829
H  -3.355082 0.151985 -1.388242
H  -4.488716 -1.552857 0.112186
H  -4.502869 -0.380632 1.447831
H  -1.881202 -0.156614 1.31073
H  -1.965736 -1.405655 0.043349
H  -5.940003 -0.003425 -1.264125
H  -5.953447 1.171446 0.065176
H  1.646229 2.300529 0.024261
H  1.350726 1.270975 -1.405595
H  -8.066157 -0.222236 0.088909
H  -7.094487 -1.715322 0.230922
H  -7.110502 -0.530646 1.567405
H  0.22293 0.564148 1.266963
H  3.870805 2.139226 0.823962
H  1.927629 -1.442924 -0.672403
H  5.923378 0.806467 1.362256
H  3.979071 -2.782108 -0.133142
H  5.983856 -1.660338 0.887188
