program: Gaussian 09
title: 000221099
version: EM64L-G09RevD.01
frameworkgroup: C1[X(C6H5ClN4)]
method: RPBEPBE
basis: SDD
operation: Freq
keyword: #p
keyword: freq=noraman
keyword: PBEPBE/SDD
title: #p freq=noraman PBEPBE/SDD
converged: NO NO NO NO
title: Mulliken charges:
elementType: Cl N N N N C C C C C C H H H H H
charge: 0.017418 -0.390316 -0.016272 0.010567 0.066830 -0.090598 0.319326 0.164870 -0.769596 -0.309722 -0.376904 0.346268 0.243850 0.286359 0.243826 0.254098
chargesum: 0.00000
title: Mulliken charges with hydrogens summed into heavy atoms:
elementType: Cl N N N N C C C C C C
charge: 0.017418 -0.044049 -0.016272 0.010567 0.066830 -0.090598 0.319326 0.164870 0.004438 -0.309722 -0.122807
polarizability: 1.43891020e+02 2.94585742e-02 1.13281983e+02 1.52717943e-03 -3.13173693e-03 4.45551714e+01
1716.lowfreq: -9.3677 -4.8728 -0.0032 -0.0023 -0.0006 9.9837 78.6040 90.5279 170.8145
frequency: 78.5916 90.5090 170.8096 182.3590 248.3043 254.9278 316.1203 370.2649 505.9035 544.1991 561.7248 603.9931 634.8769 641.0149 701.9235 731.2612 797.9063 798.2916 903.3899 918.4502 979.9378 1045.1127 1059.2732 1106.3390 1143.2249 1210.6165 1287.2780 1328.5451 1365.0452 1382.4372 1408.2446 1425.8441 1446.3023 1473.0217 1473.3646 1523.5999 1598.9950 2983.0231 3060.0493 3107.1703 3182.7615 3584.7846
redmass: 1.1996 3.1858 6.2473 6.4011 4.0935 4.7697 5.5272 16.9915 5.0485 8.4395 5.3435 7.2107 7.2531 6.8245 6.6864 1.1631 11.7053 9.3284 7.4969 1.4169 1.6726 1.4542 6.6110 7.3607 6.0657 4.3984 3.0174 3.7711 2.8342 2.0861 1.2836 2.2454 6.1647 1.0435 1.2037 5.9511 6.9806 1.0380 1.0986 1.0974 1.0927 1.0821
irintensity: 0.3303 0.3833 1.8853 3.2145 2.0438 0.7252 0.7628 8.7051 6.3885 19.9417 0.5834 5.9024 8.9386 2.2367 9.8232 95.6019 47.2279 0.0890 78.9068 13.3603 1.1762 4.1914 5.4897 13.9424 37.2174 24.7322 2.1986 50.9408 73.0688 20.3642 15.9230 54.3475 117.7882 17.6234 10.3091 57.5755 54.7108 28.2178 13.4960 2.2800 12.2705 96.7371
temp: 298.150 k
press: 1.00000 atm
elementType: 17 7 7 7 7 6 6 6 6 6 6 1 1 1 1 1
symmnumber: 1
zpe: 288478.2 jmol-1
zpe.correction: 0.109876 hartree
zpe.thermalcorrener: 0.118889 hartree
zpe.thermalcorrenthalpy: 0.119833 hartree
zpe.thermalcorrgfe: 0.074838 hartree
zpe.sumelectzpe: -909.901158 hartree
zpe.sumelectthermal: -909.892145 hartree
zpe.sumelectthermalent: -909.891201 hartree
zpe.sumelectthermalfe: -909.936195 hartree
dipole: -5.7038 -1.6044 0.0002
dipole: 5.9252
quadrupole: -63.3910 -69.3288 -70.4270
quadrupole: 8.1139 -0.0004 0.0009
quadrupole: 4.3246 -1.6132 -2.7114 8.1139 -0.0004 0.0009
hfenergy: -910.0110338 hartree
pointgroup: C01 [X(C6H5Cl1N4)]
dipole: 2.3163233 0.2625133 0.0000656 debye
dipolederiv: -0.6474091 0.4343494 0.0000406 0.5113638 -0.494646 -0.0000341 0.0000049 -0.0000074 -0.073798 -0.1939979 -0.3318303 0.0000295 -0.461572 -0.101617 -0.0000028 -0.0000083 0.0000247 -0.189255 -0.2097621 0.1951839 -0.0000364 -0.0415541 -0.3519724 -0.000006 0.0000144 0.0000182 -0.1695384 -0.4189282 0.0369615 0.0000654 0.2329073 -0.4182225 -0.0000198 -0.0000046 0.0000404 -0.1765018 -0.4441586 -0.0805402 -0.0000058 0.3154339 -1.0661862 -0.0000122 0.0001038 -0.000048 -0.1446833 -0.0514779 0.3133881 0.0000035 -0.3122185 0.1266318 0.00003 0.0000229 0.0000091 0.0166326 0.5405086 -0.1554329 0.0000312 0.3203546 0.112418 0.000005 0.0000905 -0.0000177 -0.0153265 -0.5265464 0.1221698 0.0000351 0.3546425 -0.0623616 -0.0000183 0.000024 -0.0000444 0.1108106 -0.094131 0.076514 -0.0000118 -0.0728492 -0.0255942 -0.000041 -0.0001363 -0.0000129 0.106565 1.2774755 -0.4346991 -0.000088 -0.7355606 1.2106116 0.0000583 -0.0000461 0.0000414 0.0601863 0.4218932 -0.1085053 -0.0000579 -0.1661738 0.7117943 0.0000105 -0.000207 -0.0001204 -0.0534747 0.2201056 0.0187076 0.0000009 0.0519454 0.2777592 -0.000003 -0.0000047 -0.000008 0.3129288 -0.0348915 0.005046 -0.0661075 -0.0073153 0.0847975 -0.0765639 -0.1254719 -0.0487778 -0.025611 0.1283045 -0.0564411 -0.0000266 0.037386 -0.033216 -0.0000626 0.0000236 -0.0000648 0.1293289 -0.0349153 0.0049795 0.066121 -0.0074508 0.0846939 0.0766642 0.1255044 0.0488576 -0.0254744 0.0679307 -0.0398509 0.0000066 -0.0193392 -0.0548901 -0.0000042 0.0000903 0.0001099 0.137211 unknown
polarizability: 143.1104281|-4.825423|114.0625749|-0.0010042|0.0033364|44.5551714 unknown
InChI: InChI=1S/C6H5ClN4/c1-3-4-5(11-10-3)6(7)9-2-8-4/h2,10H,1H3
charge 0 multiplicity 1
16 atoms
Cl -3.021417 1.46597 0.000171
N  1.613401 1.519943 -0.000067
N  0.263345 1.860318 -0.000032
N  0.299154 -1.79896 -0.00013
N  -2.040829 -1.066746 0.000005
C  0.639126 -0.459863 -0.000085
C  1.909461 0.168966 -0.00004
C  -0.334977 0.621778 0.000005
C  3.289861 -0.41022 0.000003
C  -1.701457 0.215559 0.000114
C  -1.025608 -2.027645 -0.00023
H  2.287283 2.28619 -0.000076
H  3.866805 -0.110537 0.894601
H  3.20691 -1.508839 -0.000399
H  3.867139 -0.109883 -0.894157
H  -1.367795 -3.065531 0.000017
