program: Gaussian 09
title: 000221997
version: EM64L-G09RevD.01
frameworkgroup: C1[X(C12H23N)]
method: RPBEPBE
basis: SDD
operation: Freq
keyword: #pfreq=noraman
keyword: PBEPBE/SDD
title: #p freq=noraman PBEPBE/SDD
converged: YES YES NO NO
title: Mulliken charges:
elementType: N C C C C C C C C C C C C H H H H H H H H H H H H H H H H H H H H H H H
charge: -0.576027 -0.015235 -0.024751 -0.189285 -0.481912 -0.477004 -0.466009 -0.418254 -0.408420 -0.412791 -0.408698 -0.407295 -0.380691 0.181939 0.196674 0.231688 0.211997 0.183483 0.196795 0.210839 0.204895 0.191016 0.215474 0.183867 0.192321 0.196445 0.192341 0.203357 0.195691 0.187760 0.190046 0.194783 0.198081 0.187509 0.253800 0.265572
chargesum: 0.00000
title: Mulliken charges with hydrogens summed into heavy atoms:
elementType: N C C C C C C C C C C C C
charge: -0.056655 0.166703 0.171923 0.042403 -0.086433 -0.069369 -0.070099 -0.018913 -0.019654 -0.017093 -0.025247 -0.022466 0.004899
polarizability: 1.54239467e+02 -1.94399668e+00 1.24312166e+02 9.06334642e-01 5.65652942e-01 1.10119422e+02
1716.lowfreq: -25.3329 -7.7755 -0.0003 0.0006 0.0007 14.9002 39.8290 68.5401 129.7542
frequency: 38.1463 68.3244 129.7061 144.4033 165.7007 209.1812 213.3205 244.9126 266.2503 308.3341 310.1862 347.7568 394.5048 421.2330 430.7677 446.9485 476.7731 505.2850 552.0933 611.4108 645.6586 756.6373 779.3354 783.3065 809.2126 843.0684 857.2813 864.1990 879.6214 890.3725 903.8780 919.5942 944.7714 978.8418 990.7354 1032.6492 1045.9009 1053.9255 1056.1208 1075.0702 1079.1613 1089.4139 1097.0146 1108.6090 1116.4640 1153.5806 1172.8000 1179.8927 1204.3197 1216.2017 1247.0384 1254.3420 1256.8376 1263.1167 1270.7120 1288.7091 1302.4357 1309.3074 1313.1045 1325.0730 1333.5275 1335.0709 1338.0549 1338.6548 1339.6687 1345.1494 1353.3512 1367.4800 1372.4737 1451.0403 1457.6610 1461.9047 1462.3849 1467.5128 1467.7445 1470.4449 1475.9618 1480.1697 1634.8651 2911.9663 2925.3004 2950.0209 2950.2872 2957.6020 2960.0167 2961.2177 2962.5177 2963.4062 2966.6565 2971.7735 3007.0313 3019.2068 3022.7306 3022.9812 3024.1092 3026.5152 3031.1459 3037.2186 3041.7724 3050.6331 3451.7796 3576.4141
redmass: 2.8615 2.8970 2.7170 3.4804 2.2644 1.4788 1.3226 3.0339 2.9142 2.1093 2.0235 2.3318 2.1684 2.0684 2.8566 2.5310 1.8171 1.9773 1.7526 1.7588 2.2815 2.5152 1.5296 2.3794 1.6262 2.2132 2.3904 1.6043 2.3375 1.4289 1.6996 2.0858 2.1738 2.0762 1.8538 1.5773 1.7101 1.2281 1.8702 1.4112 2.0936 1.4662 2.1795 1.5068 2.2703 2.2022 1.4752 1.5638 1.6109 1.5753 1.3435 1.1831 1.2903 1.2793 1.2894 1.3447 1.2516 1.2800 1.2825 1.3977 1.5987 1.4304 1.4963 1.4392 1.4910 1.5137 1.4524 1.4471 1.3365 1.0883 1.0874 1.0888 1.0894 1.0832 1.0839 1.0853 1.0960 1.0903 1.0942 1.0794 1.0824 1.0677 1.0642 1.0646 1.0626 1.0605 1.0610 1.0649 1.0644 1.0640 1.0873 1.0944 1.0960 1.0979 1.0976 1.0976 1.0992 1.1020 1.0948 1.0994 1.0443 1.0965
irintensity: 0.1232 0.0820 0.0781 0.1249 5.6537 15.9774 28.0889 1.8000 2.2949 1.3933 1.2634 0.3478 0.8826 6.9837 0.6163 1.0590 8.1601 66.9817 65.9214 91.9644 64.9362 3.4293 0.1804 0.0565 1.2121 2.9599 17.6413 6.0957 3.8445 7.4650 0.3122 0.1441 5.1654 12.2569 5.8367 6.6965 2.0317 0.3323 0.0229 0.2661 0.7928 0.7495 1.0922 0.7753 0.2562 11.0557 2.3072 9.2292 1.8708 1.4458 2.1378 0.0414 2.1300 4.5207 1.3056 2.6020 1.7808 0.3321 1.1586 0.2512 0.2215 0.1548 3.5823 0.8607 0.5946 1.0063 3.5158 0.8174 5.7881 8.0666 2.6597 5.1776 9.1010 1.6393 17.9460 19.3968 0.3933 7.3749 36.9200 0.4852 18.0265 17.7192 25.5398 64.2433 25.8755 53.7401 38.7829 36.1279 32.1629 25.9403 48.3422 111.8885 143.8110 3.5686 1.5115 20.6396 53.3276 186.1399 27.5948 56.5497 2.1821 0.0572
temp: 298.150 k
press: 1.00000 atm
elementType: 7 6 6 6 6 6 6 6 6 6 6 6 6 1 1 1 1 1 1 1 1 1 1 1 1 1 1 1 1 1 1 1 1 1 1 1
symmnumber: 1
zpe: 869619.2 jmol-1
zpe.correction: 0.331220 hartree
zpe.thermalcorrener: 0.344468 hartree
zpe.thermalcorrenthalpy: 0.345412 hartree
zpe.thermalcorrgfe: 0.292141 hartree
zpe.sumelectzpe: -524.761422 hartree
zpe.sumelectthermal: -524.748174 hartree
zpe.sumelectthermalent: -524.747230 hartree
zpe.sumelectthermalfe: -524.800501 hartree
dipole: 0.8275 1.0095 0.1246
dipole: 1.3113
quadrupole: -85.2039 -87.1895 -80.1219
quadrupole: -4.2107 0.6031 0.7430
quadrupole: -1.0321 -3.0177 4.0499 -4.2107 0.6031 0.7430
hfenergy: -525.0926424 hartree
pointgroup: C01 [X(C12H23N1)]
dipole: 0.3306316 -0.3921689 -0.0550851 debye
polarizability: 154.2133418|2.2533463|124.3061004|-0.0209541|1.0394072|110.1516132 unknown
InChI: InChI=1S/C12H23N/c13-12-9-5-4-8-11(12)10-6-2-1-3-7-10/h10-12H,1-9,13H2
charge 0 multiplicity 1
36 atoms
N  -1.504426 1.736416 -1.142565
C  -0.618274 -0.203765 0.312279
C  0.862409 -0.025625 -0.155873
C  -1.459517 1.124395 0.208613
C  -1.34895 -1.34519 -0.449329
C  1.566196 1.171204 0.545416
C  1.701274 -1.316213 0.072198
C  -2.905086 0.892633 0.719261
C  -2.801113 -1.553653 0.044424
C  -3.624492 -0.24821 -0.035895
C  3.046006 1.329929 0.121319
C  3.180913 -1.158289 -0.351175
C  3.851516 0.034515 0.365793
H  -0.593447 -0.479464 1.392395
H  0.851435 0.180239 -1.251066
H  -1.00029 1.879272 0.873831
H  -0.794489 -2.295728 -0.344965
H  -1.357974 -1.108311 -1.535736
H  1.514047 1.018902 1.645095
H  1.032248 2.117998 0.335645
H  1.258532 -2.166386 -0.479369
H  1.65756 -1.578674 1.151506
H  -3.463321 1.841593 0.619671
H  -2.863881 0.636461 1.798013
H  -2.775751 -1.898445 1.099464
H  -3.288947 -2.356845 -0.54226
H  -3.774542 0.035575 -1.098344
H  -4.636098 -0.403098 0.38674
H  3.504288 2.178525 0.666364
H  3.089901 1.583535 -0.95887
H  3.231982 -0.997089 -1.448482
H  3.733204 -2.095502 -0.14125
H  4.896609 0.157153 0.020351
H  3.893915 -0.170082 1.456056
H  -1.934177 1.14228 -1.859003
H  -0.607357 2.117443 -1.460254
