program: Gaussian 09
title: 000222002
version: EM64L-G09RevD.01
frameworkgroup: C1[X(C13H17NO5)]
method: RPBEPBE
basis: SDD
operation: Freq
keyword: #p
keyword: freq=noraman
keyword: PBEPBE/SDD
title: #p freq=noraman PBEPBE/SDD
converged: YES YES NO NO
title: Mulliken charges:
elementType: O O O O O N C C C C C C C C C C C C C H H H H H H H H H H H H H H H H H
charge: -0.219261 -0.214547 -0.189715 -0.207697 -0.265063 0.109544 0.311288 -0.406512 -0.382126 -0.412919 -0.182753 -0.701182 0.510590 -0.455153 -0.325175 -0.351161 -0.354266 0.327558 -0.538326 0.187926 0.278038 0.277938 0.184000 0.239533 0.210590 0.201145 0.242571 0.226894 0.227768 0.227634 0.258309 0.251034 0.241861 0.223436 0.223272 0.244931
chargesum: 0.00000
title: Mulliken charges with hydrogens summed into heavy atoms:
elementType: O O O O O N C C C C C C C C C C C C C
charge: -0.219261 -0.214547 -0.189715 -0.207697 -0.265063 0.109544 0.311288 0.059452 0.079811 0.037204 0.018392 -0.003950 0.510590 -0.227520 -0.066866 -0.100127 -0.112406 0.327558 0.153312
polarizability: 2.31560745e+02 1.13965291e+01 1.52949776e+02 -2.45992734e+00 -2.40639669e+00 1.16270343e+02
1716.lowfreq: -3.5297 0.0007 0.0008 0.0009 6.9453 11.7962 19.3575 32.7199 42.8869
frequency: 19.3389 32.6036 42.8681 52.8395 75.8286 104.2561 111.1542 156.1553 167.1669 178.5165 203.9692 217.0256 239.2549 250.5192 285.8764 306.0808 322.2891 363.5551 378.4904 384.4179 413.8093 441.5195 458.2401 495.8627 523.1562 536.5649 547.6327 570.9851 598.2657 630.3036 679.4600 729.8194 757.0627 765.7187 777.2833 814.1058 819.8263 840.7167 860.9178 889.1451 901.6329 911.4212 948.1102 956.9069 960.9656 964.0720 986.8987 1003.8428 1024.8542 1056.8447 1065.8237 1100.3672 1111.9368 1112.7382 1143.2988 1156.1752 1177.0855 1196.9762 1213.9547 1220.0068 1232.6286 1235.5902 1256.6116 1301.9631 1307.0013 1309.4362 1330.8674 1351.5963 1354.4481 1374.6651 1398.0753 1402.4474 1410.9061 1421.7773 1436.7520 1440.1688 1444.9058 1466.8130 1467.5128 1473.8279 1483.8211 1487.0690 1509.6238 1590.7555 1626.7010 2893.7878 2941.3346 2949.9521 2962.3723 2990.9116 2994.0890 3046.4615 3051.2734 3088.3516 3093.9804 3109.8895 3122.3367 3124.2421 3126.1706 3151.8235 3168.6965 3172.8809
redmass: 3.8612 6.0711 6.6345 6.0532 2.4986 3.6516 5.6028 4.3339 6.1447 2.5750 2.8609 1.6724 2.8048 1.5346 2.4996 3.2570 2.8671 3.6796 2.5082 4.8174 2.9392 4.7775 4.0502 3.8356 4.8691 3.5090 3.4719 6.3719 6.3759 7.0343 4.2745 3.7864 5.1615 8.0697 1.4372 1.8855 1.3750 3.2640 3.0001 3.2159 5.5060 1.7450 1.5339 4.8130 1.3717 2.8783 8.0941 2.6518 2.5220 1.8992 2.7950 3.2368 1.2711 1.3210 2.3999 1.3352 1.2295 2.1043 1.6334 5.4045 3.4094 1.3254 1.2960 1.3623 1.2327 1.2043 1.3442 2.3937 1.3078 1.3101 3.5794 2.5914 1.5592 3.0542 1.1734 1.1695 1.0889 1.1018 1.0502 1.0698 1.0571 1.0443 2.7331 7.2019 6.4203 1.0839 1.0692 1.0697 1.0328 1.0591 1.0376 1.1010 1.1040 1.0994 1.1007 1.0938 1.0929 1.0900 1.0996 1.0877 1.0950 1.0966
irintensity: 3.4669 2.5142 1.2947 1.8313 0.4672 2.4607 0.3568 1.2498 3.0556 2.7087 1.5589 0.7686 1.5316 2.4020 0.7331 2.1386 1.2259 4.4811 12.9757 1.1304 0.1306 0.9340 1.2310 1.0281 7.4078 1.1892 20.8353 20.2390 13.2968 1.6096 1.2452 2.8715 1.4224 27.3778 7.7978 145.0262 36.6580 7.4636 9.8981 10.3008 15.1345 1.8787 8.9063 27.3559 1.0169 70.3918 43.4547 12.0102 114.4721 10.2754 105.4302 15.6839 1.5158 7.0968 11.9423 0.7021 85.6464 6.8239 8.0247 50.3184 173.7184 6.2106 34.1385 21.0268 4.6881 4.7905 4.9698 99.8164 7.6324 11.6967 19.4084 137.3504 27.6651 14.1071 5.3090 2.7054 12.0047 8.5940 13.8224 41.0392 16.3830 13.8276 60.1782 13.1070 114.2293 55.8806 10.9933 105.6570 62.4197 29.7481 17.7385 5.2690 46.8586 33.5724 28.5888 3.5788 4.0220 15.0008 25.7108 7.8479 11.0574 3.4937
temp: 298.150 k
press: 1.00000 atm
elementType: 8 8 8 8 8 7 6 6 6 6 6 6 6 6 6 6 6 6 6 1 1 1 1 1 1 1 1 1 1 1 1 1 1 1 1 1
symmnumber: 1
zpe: 749825.5 jmol-1
zpe.correction: 0.285593 hartree
zpe.thermalcorrener: 0.304039 hartree
zpe.thermalcorrenthalpy: 0.304983 hartree
zpe.thermalcorrgfe: 0.237416 hartree
zpe.sumelectzpe: -934.889574 hartree
zpe.sumelectthermal: -934.871129 hartree
zpe.sumelectthermalent: -934.870185 hartree
zpe.sumelectthermalfe: -934.937752 hartree
dipole: -1.2289 -3.2735 -0.3083
dipole: 3.5101
quadrupole: -89.5745 -107.4190 -119.2609
quadrupole: 24.5393 0.7262 -1.5901
quadrupole: 15.8436 -2.0009 -13.8428 24.5393 0.7262 -1.5901
hfenergy: -935.1751679 hartree
pointgroup: C01 [X(C13H17N1O5)]
dipole: 0.4638749 1.2949295 -0.1229459 debye
polarizability: 231.2553494|12.5342509|153.2809906|1.3452113|2.4009129|116.2445235 unknown
InChI: InChI=1S/C13H17NO5/c1-3-13(14(15)16)8-18-12(19-9-13)10-4-6-11(17-2)7-5-10/h4-7,12H,3,8-9H2,1-2H3
charge 0 multiplicity 1
36 atoms
O  0.77211 0.411613 -1.135618
O  0.727866 0.398808 1.269262
O  2.85728 -1.969835 -0.952996
O  3.311116 -1.857187 1.271409
O  -5.472363 -0.202575 -0.026243
N  3.016268 -1.319852 0.140945
C  2.942208 0.242391 0.107023
C  2.212296 0.703336 -1.172419
C  2.156493 0.718853 1.354506
C  4.412781 0.746379 0.17836
C  0.131155 0.98945 0.0552
C  5.322903 0.299662 -0.98614
C  -1.331759 0.657531 0.025352
C  -2.31039 1.679896 0.07068
C  -1.745529 -0.692538 -0.040813
C  -3.680601 1.363697 0.051664
C  -3.115219 -1.027243 -0.060172
C  -4.08591 0.006871 -0.013029
C  -5.950316 -1.586372 -0.092302
H  2.380332 1.798773 -1.276041
H  2.586865 0.182693 -2.063777
H  2.525596 0.219203 2.262075
H  2.300826 1.818906 1.442548
H  4.83995 0.405487 1.140627
H  4.37509 1.852707 0.216246
H  0.324059 2.089939 0.069735
H  5.385416 -0.800104 -1.06128
H  4.972574 0.686799 -1.959426
H  6.346145 0.682317 -0.825525
H  -2.002524 2.731415 0.121814
H  -0.987779 -1.481186 -0.080032
H  -4.449877 2.140562 0.085677
H  -3.411606 -2.07892 -0.111453
H  -5.615488 -2.170296 0.78685
H  -5.611475 -2.085296 -1.020866
H  -7.047497 -1.510483 -0.091141
