program: Gaussian 09
title: 000222042
version: EM64L-G09RevD.01
frameworkgroup: C1[X(C21H31NO2)]
method: RPBEPBE
basis: SDD
operation: Freq
keyword: #p
keyword: freq=noraman
keyword: PBEPBE/SDD
title: #p freq=noraman PBEPBE/SDD
converged: YES YES NO NO
title: Mulliken charges:
elementType: O O N C C C C C C C C C C C C C C C C C C C C C H H H H H H H H H H H H H H H H H H H H H H H H H H H H H H H
charge: -0.258125 -0.247854 -0.094349 -0.058437 -0.101911 -0.043785 -0.425800 -0.398540 -0.487279 -0.461027 -0.427756 -0.416117 -0.445594 -0.341852 -0.752312 -0.741378 0.506578 -0.319198 0.234912 -0.452694 -0.383126 -0.228740 -0.240704 -0.245302 0.215451 0.229375 0.248147 0.190503 0.226331 0.218813 0.172588 0.223976 0.216021 0.187568 0.242695 0.240490 0.213418 0.207645 0.211350 0.209981 0.186782 0.248985 0.220069 0.217228 0.214362 0.218991 0.208358 0.216741 0.241194 0.229832 0.232689 0.265466 0.224111 0.224152 0.227078
chargesum: 0.00000
title: Mulliken charges with hydrogens summed into heavy atoms:
elementType: O O N C C C C C C C C C C C C C C C C C C C C C
charge: -0.258125 -0.247854 -0.094349 0.157014 0.127463 0.204363 -0.008967 -0.007139 -0.047282 -0.030763 -0.187266 0.004945 -0.024262 0.093916 -0.100653 -0.097287 0.506578 0.151828 0.234912 -0.220005 -0.117660 -0.004629 -0.016552 -0.018224
polarizability: 2.77966459e+02 2.48218893e+01 2.17896645e+02 5.92591103e-01 1.33778536e+00 2.08298441e+02
1716.lowfreq: -17.4364 -4.6786 -0.0007 -0.0002 0.0009 3.8293 9.9506 14.7558 24.5113
frequency: -16.2810 12.7633 24.4651 26.1609 39.5333 47.1940 48.6591 53.5063 56.0663 77.7006 98.1674 110.1410 132.7244 158.5458 187.4768 199.8491 206.1369 222.1503 241.6412 251.2314 263.4102 277.2046 294.0439 316.7436 322.0323 345.6491 373.7368 404.8595 417.4723 430.5541 485.6186 503.4697 538.7834 549.0962 596.1052 614.6733 619.1616 646.4625 684.4852 704.0178 711.1937 764.7491 769.5140 772.9267 802.4216 816.0256 842.6542 849.3930 856.0086 860.1799 873.7535 894.1515 895.7875 912.7619 924.3978 941.9275 945.7991 955.3155 957.2551 968.0799 978.5926 983.8156 986.0044 990.2711 996.1626 1027.6711 1031.9397 1050.0417 1067.2908 1077.9793 1086.2179 1090.7004 1092.2189 1100.9549 1112.0865 1120.8950 1134.6241 1154.9141 1162.2292 1170.1187 1171.7250 1179.1453 1183.2767 1185.5685 1190.2880 1198.5638 1208.4599 1215.9337 1236.7599 1239.5829 1247.8353 1269.7068 1276.7021 1279.1233 1285.2721 1291.9389 1301.5079 1303.4756 1304.9738 1309.7010 1312.8387 1316.1632 1329.6188 1338.0975 1343.7439 1350.5639 1358.4827 1381.7823 1383.5311 1387.3437 1391.5068 1442.3398 1450.0719 1465.6772 1469.7421 1472.1867 1473.5896 1474.1354 1475.8181 1476.3368 1479.4064 1480.7213 1488.2174 1491.1090 1499.2994 1592.1171 1609.6329 1628.0037 2830.4700 2864.0478 2896.2944 2966.1706 2969.6805 2971.2612 2971.8537 2978.4192 2988.3412 2990.5163 2993.1477 2996.2368 3008.4224 3020.1977 3030.8830 3041.5002 3041.6256 3051.1899 3057.3287 3064.0365 3064.4156 3064.8987 3068.2070 3069.1717 3078.1113 3116.9073 3121.5803 3124.9094 3137.2007 3147.5262 3162.4911
redmass: 2.8156 4.6400 4.0683 2.8536 2.9641 2.4296 4.0956 3.5624 3.0061 2.9063 3.7551 3.2923 5.3383 2.8070 2.4224 1.1132 3.7460 1.1442 3.7777 2.1738 3.0905 2.8391 3.8373 5.8446 2.0104 3.8160 3.7117 2.8302 2.5269 2.6628 2.7033 3.1033 3.6167 4.4546 2.6790 6.2251 3.6326 3.9245 4.4591 2.8985 2.2936 1.5194 2.1096 1.4943 1.3559 2.1281 3.1984 3.8427 1.3709 3.2442 3.0485 1.8713 2.4417 1.3890 1.6467 2.0657 1.9430 1.6342 1.4089 2.2232 1.4002 1.3048 1.3437 4.9342 1.3765 2.2232 2.9598 2.9448 3.1403 1.7273 2.1808 2.1664 2.3536 2.6403 3.4563 1.6472 1.9770 1.9687 1.4893 2.3736 1.0637 1.4594 1.4691 1.4364 1.1159 2.6059 2.0818 1.5691 1.3420 1.2658 1.3079 1.3138 1.3445 1.1621 1.4338 1.2951 1.2502 1.2477 1.2558 1.3922 1.4135 1.4532 1.3925 1.4608 1.3548 1.4831 1.6102 1.3230 4.8552 1.3625 1.2269 2.1351 1.0973 1.0830 1.0866 1.0533 1.0562 1.0821 1.0719 1.0550 1.0476 2.2475 1.0788 1.0983 1.0903 6.0829 6.0361 8.7659 1.0709 1.0701 1.0703 1.0755 1.0373 1.0404 1.0677 1.0663 1.0859 1.0735 1.0650 1.0913 1.0651 1.0896 1.0848 1.0585 1.0992 1.0880 1.1003 1.0992 1.0992 1.0991 1.0992 1.0989 1.1041 1.0860 1.1095 1.0868 1.0919 1.0959 1.1015
irintensity: 0.1470 0.4744 0.0680 0.3596 0.0138 0.0398 0.3495 0.0761 0.4982 0.8491 1.0015 0.9798 1.5011 1.3786 0.7539 0.0870 0.2337 0.1075 2.3101 1.2951 5.6494 1.8057 1.5791 4.7187 2.7854 19.3860 3.2998 0.1213 0.7575 3.2503 1.1624 10.5725 2.6342 8.9987 6.5775 0.1305 4.3327 3.1990 6.4493 19.0031 44.7392 26.9682 1.4847 12.5186 3.2997 0.6692 2.4087 9.8914 0.8022 0.5440 0.9233 2.6598 6.3278 8.2359 20.3852 35.9992 35.2020 5.1778 0.7988 5.3631 0.1365 10.4256 4.0385 1.6071 0.2885 7.2977 20.8717 10.5343 18.9413 21.2835 1.3040 0.4319 5.9402 205.5660 147.1877 4.4698 23.9330 5.7066 28.4451 7.3174 0.9787 2.4823 15.4944 3.9344 0.4896 7.6635 14.3637 22.0971 24.0222 2.1094 12.7687 10.8769 1.2413 0.7884 31.0050 13.0231 2.7117 1.3511 2.1726 7.3141 11.8899 3.6475 5.4987 22.4370 4.9707 10.1639 2.0178 14.2727 4.4620 8.7165 8.9242 10.4099 6.4676 3.5088 3.4858 3.2442 8.2683 12.9688 11.0847 6.8134 11.1156 24.4152 5.7238 2.8895 13.2564 3.0714 14.1580 100.9006 91.8394 86.1680 85.0493 9.8972 32.9460 49.4674 20.7645 28.2004 6.3038 6.0208 53.2605 73.3499 59.6913 33.1914 13.0366 27.0905 20.5944 10.2699 10.2317 16.5050 27.6467 51.4593 63.0970 52.4243 91.1354 6.3527 15.1242 0.6350 21.7606 26.3481 27.5090
temp: 298.150 k
press: 1.00000 atm
elementType: 8 8 7 6 6 6 6 6 6 6 6 6 6 6 6 6 6 6 6 6 6 6 6 6 1 1 1 1 1 1 1 1 1 1 1 1 1 1 1 1 1 1 1 1 1 1 1 1 1 1 1 1 1 1 1
symmnumber: 1
zpe: 1252725.7 jmol-1
zpe.correction: 0.477138 hartree
zpe.thermalcorrener: 0.501294 hartree
zpe.thermalcorrenthalpy: 0.502239 hartree
zpe.thermalcorrgfe: 0.419306 hartree
zpe.sumelectzpe: -1022.177324 hartree
zpe.sumelectthermal: -1022.153168 hartree
zpe.sumelectthermalent: -1022.152224 hartree
zpe.sumelectthermalfe: -1022.235156 hartree
dipole: 1.1349 0.9846 -1.5464
dipole: 2.1561
quadrupole: -131.7562 -143.0969 -144.4016
quadrupole: 3.5269 -0.0126 0.7994
quadrupole: 7.9954 -3.3454 -4.6500 3.5269 -0.0126 0.7994
hfenergy: -1022.6544624 hartree
pointgroup: C01 [X(C21H31N1O2)]
dipole: 0.4844736 0.1780301 0.6731823 debye
polarizability: 283.2018187|-12.0688226|211.6954798|11.3821911|-2.1073875|209.2642465 unknown
InChI: InChI=1S/C21H31NO2/c1-16-14-22(15-17(16)2)12-13-24-21(23)20(19-10-6-7-11-19)18-8-4-3-5-9-18/h3-5,8-9,16-17,19-20H,6-7,10-15H2,1-2H3
charge 0 multiplicity 1
55 atoms
O  0.055981 0.85137 0.099218
O  -0.471094 -0.970297 -1.258844
N  3.732937 0.308373 -0.629456
C  6.101893 -0.254933 -0.700516
C  5.886237 1.292269 -0.648662
C  -2.353946 -1.619109 1.01195
C  4.66074 -0.851361 -0.787476
C  4.490079 1.415956 -0.001997
C  -1.2293 -2.143968 1.952785
C  -3.628338 -1.728138 1.886269
C  -2.088421 -0.188682 0.454597
C  -1.914357 -3.190842 2.893542
C  -3.447507 -3.090332 2.600842
C  2.407557 0.009805 -0.069358
C  7.031373 -0.715338 -1.839852
C  6.998006 2.053909 0.094223
C  -3.24159 0.315266 -0.423946
C  1.361334 1.00075 -0.616364
C  -0.779686 -0.178113 -0.336555
C  -4.049231 1.393537 0.014711
C  -3.539721 -0.304133 -1.665767
C  -5.14085 1.841637 -0.763937
C  -4.628305 0.144109 -2.445146
C  -5.435302 1.216451 -1.997034
H  6.552165 -0.558267 0.267231
H  5.810938 1.667097 -1.689246
H  -2.452477 -2.307723 0.148637
H  4.510691 -1.615084 0.011399
H  4.479772 -1.350228 -1.759756
H  4.017361 2.394713 -0.205783
H  4.568495 1.302731 1.112089
H  -0.386616 -2.574835 1.383447
H  -0.824372 -1.301487 2.54799
H  -3.641235 -0.903225 2.628417
H  -4.561121 -1.664541 1.299857
H  -1.962451 0.503945 1.306733
H  -1.540449 -4.213746 2.708056
H  -1.700085 -2.95809 3.952558
H  -3.758917 -3.906249 1.920936
H  -4.060199 -3.175191 3.516137
H  2.398241 0.048373 1.04915
H  2.109259 -1.009168 -0.37198
H  6.60233 -0.444876 -2.82314
H  7.179365 -1.811344 -1.825276
H  8.028648 -0.243094 -1.760817
H  7.978813 1.907342 -0.394968
H  7.085958 1.702188 1.140204
H  6.798144 3.141492 0.118095
H  1.209213 0.836069 -1.696254
H  1.646784 2.046043 -0.421113
H  -3.822261 1.88358 0.969575
H  -2.905605 -1.122411 -2.025552
H  -5.756634 2.676438 -0.410193
H  -4.845616 -0.3400 -3.404164
H  -6.279933 1.563063 -2.603197
