program: Gaussian 09
title: 000221995
version: EM64L-G09RevD.01
frameworkgroup: C1[X(C12H17NO)]
method: RPBEPBE
basis: SDD
operation: Freq
keyword: #p
keyword: freq=noraman
keyword: PBEPBE/SDD
title: #p freq=noraman PBEPBE/SDD
converged: YES YES NO NO
title: Mulliken charges:
elementType: O N C C C C C C C C C C C C H H H H H H H H H H H H H H H H H
charge: -0.277126 -0.376465 -0.544803 -0.372097 -0.501212 0.472743 -0.347047 0.243105 -0.426979 -0.397676 -0.682808 -0.226357 -0.224923 -0.241577 0.214302 0.227122 0.261132 0.221465 0.227807 0.198905 0.312646 0.242412 0.199256 0.244017 0.233833 0.210383 0.205341 0.221296 0.226967 0.226366 0.229972
chargesum: 0.00000
title: Mulliken charges with hydrogens summed into heavy atoms:
elementType: O N C C C C C C C C C C C C
charge: -0.277126 -0.063818 -0.103379 0.110500 -0.074500 0.472743 0.094620 0.243105 -0.182962 -0.163843 -0.045789 0.000610 0.001443 -0.011605
polarizability: 1.63637535e+02 -5.67243697e+00 1.44059547e+02 2.16907813e+01 1.72573457e-01 9.78605680e+01
1716.lowfreq: -8.5705 -2.0898 0.0004 0.0005 0.0006 10.3148 21.6059 27.7718 31.4381
frequency: 21.5469 27.7268 31.3578 49.2162 83.9487 89.0289 132.5208 175.3373 227.4975 234.4724 292.5582 320.0662 352.6182 392.3333 404.7427 437.9807 490.9534 559.1785 584.8178 609.5259 617.9739 695.3614 706.8654 745.2789 755.7655 767.4541 828.2065 856.7876 870.3015 882.3643 917.9989 929.2012 974.3449 978.7012 989.4995 995.9384 1023.4105 1029.4498 1059.5565 1063.1276 1088.5284 1096.4460 1118.4386 1172.0803 1181.0561 1187.4103 1202.7282 1211.9840 1233.8203 1249.1360 1276.9401 1310.2358 1313.9625 1329.8568 1349.5032 1360.4715 1381.8032 1390.5656 1439.5640 1447.3045 1454.9200 1468.8840 1476.5585 1478.0516 1482.8383 1487.3539 1488.9247 1591.7673 1612.7942 1616.9709 2971.1303 2973.0127 2989.6608 2990.1823 2994.8300 3025.5279 3048.6993 3059.8341 3074.1253 3076.0898 3077.1330 3114.1119 3118.5607 3133.1723 3144.1460 3162.8809 3546.2460
redmass: 3.6462 3.8893 5.7874 2.7615 2.4581 2.6734 3.5372 3.1221 4.8503 1.1046 3.0483 3.3493 2.1934 3.2743 2.8277 2.4885 4.0298 2.3756 1.8217 1.8941 5.9230 3.5711 1.8400 1.2073 1.9704 2.7333 2.3558 1.2481 1.4264 1.9647 1.6135 2.0633 2.3023 1.5084 5.9295 1.3191 2.1288 1.9978 2.8052 1.9790 1.5900 1.9637 2.4658 1.0659 1.2314 1.1170 1.6094 2.3476 1.2973 1.3894 1.2209 1.3102 1.3587 1.2614 1.5053 1.3875 7.2875 1.2138 2.1511 1.1027 1.1231 1.1271 1.0468 1.0455 2.1877 1.0839 1.9064 6.0129 6.1425 6.1479 1.0443 1.0504 1.0644 1.0647 1.0616 1.0971 1.1000 1.0999 1.0990 1.1016 1.0998 1.0873 1.0866 1.0909 1.0959 1.1015 1.0775
irintensity: 0.7020 0.3724 7.7868 0.8792 0.5171 0.2411 8.1681 4.1294 0.6779 0.0335 10.6303 0.8596 0.3507 1.7947 0.0309 12.3318 8.4138 6.9099 108.8990 22.2620 1.2262 2.1428 46.6860 13.0327 25.8397 14.9889 9.5665 0.1304 0.8644 7.2146 1.6254 3.1683 2.2665 0.6011 0.1219 0.0777 22.6123 2.1873 5.5769 1.5080 13.1499 17.3610 3.2953 1.0664 24.7849 1.1735 23.4980 1.8181 0.8270 70.7841 19.0222 26.6614 3.1008 5.6430 9.8185 12.9270 0.5071 9.9093 6.1698 12.5514 39.3055 12.4242 5.5397 8.4265 109.9915 16.8997 176.3982 1.2161 37.5277 152.2643 23.9800 32.9964 45.5475 15.5445 33.4046 15.4148 0.1783 23.4976 47.1683 75.3205 10.3401 8.6487 5.9347 10.5828 42.7051 20.9966 17.9917
temp: 298.150 k
press: 1.00000 atm
elementType: 8 7 6 6 6 6 6 6 6 6 6 6 6 6 1 1 1 1 1 1 1 1 1 1 1 1 1 1 1 1 1
symmnumber: 1
zpe: 695061.8 jmol-1
zpe.correction: 0.264735 hartree
zpe.thermalcorrener: 0.279308 hartree
zpe.thermalcorrenthalpy: 0.280253 hartree
zpe.thermalcorrgfe: 0.220013 hartree
zpe.sumelectzpe: -596.408953 hartree
zpe.sumelectthermal: -596.394379 hartree
zpe.sumelectthermalent: -596.393435 hartree
zpe.sumelectthermalfe: -596.453674 hartree
dipole: -2.5041 2.3561 -1.4013
dipole: 3.7129
quadrupole: -87.9727 -84.2834 -84.7868
quadrupole: 9.5923 1.3860 2.0533
quadrupole: -2.2917 1.3976 0.8942 9.5923 1.3860 2.0533
hfenergy: -596.6736877 hartree
pointgroup: C01 [X(C12H17N1O1)]
dipole: 1.0028144 0.9692818 0.434392 debye
polarizability: 164.9460025|7.3901127|143.5981752|18.9895761|-4.6265703|97.013472 unknown
InChI: InChI=1S/C12H17NO/c1-2-6-12(14)13-10-9-11-7-4-3-5-8-11/h3-5,7-8,13H,2,6,9-10H2,1H3
charge 0 multiplicity 1
31 atoms
O  -2.805857 -1.901178 0.033945
N  -0.874507 -0.807161 0.740071
C  1.0035 -1.68081 -0.700019
C  0.02322 -1.940407 0.482125
C  -3.019634 0.415779 0.829446
C  1.93239 -0.502595 -0.443975
C  -4.009268 0.807896 -0.29415
C  -2.239576 -0.860057 0.491479
C  1.643572 0.784696 -0.968466
C  3.087464 -0.655627 0.368371
C  -4.922262 1.982531 0.113146
C  2.481946 1.889002 -0.687119
C  3.927773 0.443983 0.651791
C  3.626339 1.722623 0.12602
H  1.592066 -2.606324 -0.851932
H  0.406438 -1.515131 -1.61514
H  -0.624638 -2.803247 0.249635
H  0.600841 -2.170801 1.398443
H  -3.596899 0.215971 1.754776
H  -2.334042 1.257547 1.053101
H  -0.462772 0.071573 1.059872
H  -4.612765 -0.083527 -0.544457
H  -3.441585 1.070717 -1.208645
H  0.765621 0.916779 -1.612795
H  3.333214 -1.64576 0.773273
H  -5.527746 1.723391 1.002403
H  -4.333729 2.886998 0.358953
H  -5.619299 2.245826 -0.703141
H  2.246238 2.873752 -1.10675
H  4.818313 0.304607 1.275257
H  4.279343 2.575758 0.341287
