program: Gaussian 09
title: 000221985
version: EM64L-G09RevD.01
frameworkgroup: C1[X(C11H21NO4)]
method: RPBEPBE
basis: SDD
operation: Freq
keyword: #p
keyword: freq=noraman
keyword: PBEPBE/SDD
title: #p freq=noraman PBEPBE/SDD
converged: YES YES NO NO
title: Mulliken charges:
elementType: O O O O N C C C C C C C C C C C H H H H H H H H H H H H H H H H H H H H H
charge: -0.217791 -0.223667 -0.197457 -0.199268 0.132934 0.251975 0.020193 -0.369853 -0.363788 -0.447332 -0.376777 -0.364515 -0.701402 -0.355436 -0.355854 -0.696103 0.185432 0.273206 0.184472 0.185224 0.272265 0.215370 0.234764 0.179386 0.228324 0.187160 0.196918 0.222403 0.247381 0.247355 0.191821 0.185874 0.197130 0.194470 0.215832 0.210605 0.208748
chargesum: 0.00000
title: Mulliken charges with hydrogens summed into heavy atoms:
elementType: O O O O N C C C C C C C C C C C
charge: -0.217791 -0.223667 -0.197457 -0.199268 0.132934 0.251975 0.205626 0.087825 0.093701 0.002801 0.030933 0.019563 0.015738 0.022259 0.035745 -0.060918
polarizability: 1.69810866e+02 -3.68345677e+00 1.26014668e+02 8.94472370e-01 3.78769625e+00 1.22714711e+02
1716.lowfreq: -20.8997 -11.5095 -0.0005 0.0005 0.0009 6.4227 14.7686 20.5224 26.3691
frequency: 8.4901 17.9911 26.3321 45.3431 56.8806 86.3291 104.7626 131.4152 135.9128 165.1928 183.4005 190.2990 225.4177 229.9672 253.7031 263.8297 303.7344 332.2594 368.3689 408.2393 413.5970 456.6742 484.2175 518.2688 541.1679 547.5405 614.5820 686.0525 721.4491 732.1139 764.1968 765.1808 819.5310 841.8764 881.1330 889.5267 893.8541 897.6543 962.8818 980.8998 984.2943 993.4229 1010.0927 1037.6645 1046.0925 1068.6422 1080.6331 1088.3120 1098.6181 1121.3371 1150.2597 1176.7056 1199.2120 1208.2248 1220.9228 1229.0264 1245.4015 1260.6566 1273.6678 1278.7191 1282.3513 1286.9672 1292.7646 1317.6380 1323.6976 1346.3390 1351.3703 1355.1838 1366.1815 1380.0776 1386.4387 1394.2990 1410.8410 1440.8588 1447.4000 1451.8809 1461.8197 1464.0488 1468.6551 1473.4645 1476.1703 1478.2805 1482.4521 1488.1000 2873.1548 2943.7469 2950.5083 2952.5747 2954.1137 2961.7720 2967.7898 2971.0064 2988.5861 2994.7465 3002.9092 3006.0907 3026.7315 3041.2565 3067.5187 3070.7425 3071.8932 3096.2206 3100.0701 3114.5168 3117.2760
redmass: 2.8628 2.1648 12.7477 3.7965 3.9328 2.7703 1.8984 2.3874 3.6813 3.6021 1.2690 3.0569 3.5772 1.1475 2.7241 3.0947 3.4306 3.0984 2.4104 3.2927 3.3644 3.5560 3.7330 4.1555 5.9682 3.7176 4.8169 5.5441 1.0688 1.1969 1.8903 4.5428 1.6247 3.0179 3.1411 1.9595 1.7834 1.6026 3.0099 2.0896 1.3583 1.9963 3.0837 2.9419 3.1526 3.0783 2.0907 2.0618 2.7169 2.4347 2.4236 2.1822 1.5372 1.4340 11.9102 1.3335 1.3582 2.0518 1.2571 1.1718 1.1265 1.1539 1.1011 1.2496 1.2263 1.4192 1.3661 1.5823 1.2938 1.7718 1.2173 1.2197 4.4497 1.2164 1.0914 1.0844 1.0646 1.0766 1.0815 1.0727 1.0429 1.0518 1.0804 1.0902 1.0830 1.0690 1.0589 1.0694 1.0601 1.0638 1.0597 1.0364 1.0962 1.0352 1.0657 1.0934 1.1008 1.1011 1.1008 1.0993 1.1028 1.0998 1.1009 1.0926 1.0945
irintensity: 0.9202 0.7103 0.0958 1.0840 0.7371 0.0867 0.0541 0.1249 0.4293 0.4689 0.3211 1.0742 2.2894 0.1582 0.6438 2.3354 3.3507 1.4706 11.0008 1.0171 3.9379 0.4168 5.7531 4.3319 10.2838 5.4199 7.1494 2.3086 10.7485 3.0089 12.7142 17.8958 32.2202 18.0820 28.9780 10.4497 10.6759 5.4801 28.6349 17.0271 11.1631 0.8001 1.6513 1.7822 95.3591 44.0106 1.7750 57.4166 10.8603 6.2004 23.6476 1.0863 1.5421 0.1596 64.7548 6.9096 1.1325 3.8707 7.8867 0.9561 11.1522 5.4527 3.7918 1.4527 7.2268 4.1042 1.8938 5.3188 0.1312 31.2428 10.2825 22.7699 166.3318 2.3465 14.7285 6.1678 0.2380 0.3266 6.8148 1.8125 12.4233 19.2484 1.8899 24.9778 68.9285 11.8371 0.1081 96.0465 5.7790 21.0313 119.7490 37.4771 2.7187 18.7289 14.8411 8.0907 21.9525 46.4418 70.8904 54.0325 73.0588 14.5587 8.9592 4.3938 4.3552
temp: 298.150 k
press: 1.00000 atm
elementType: 8 8 8 8 7 6 6 6 6 6 6 6 6 6 6 6 1 1 1 1 1 1 1 1 1 1 1 1 1 1 1 1 1 1 1 1 1
symmnumber: 1
zpe: 823166.4 jmol-1
zpe.correction: 0.313528 hartree
zpe.thermalcorrener: 0.331908 hartree
zpe.thermalcorrenthalpy: 0.332852 hartree
zpe.thermalcorrgfe: 0.263034 hartree
zpe.sumelectzpe: -786.014373 hartree
zpe.sumelectthermal: -785.995993 hartree
zpe.sumelectthermalent: -785.995049 hartree
zpe.sumelectthermalfe: -786.064866 hartree
dipole: 0.0876 -2.1986 5.0079
dipole: 5.4700
quadrupole: -93.4512 -102.0523 -99.6530
quadrupole: -5.2277 17.5995 -0.3666
quadrupole: 4.9343 -3.6668 -1.2675 -5.2277 17.5995 -0.3666
hfenergy: -786.3279007 hartree
pointgroup: C01 [X(C11H21N1O4)]
dipole: -0.0493442 -0.2971004 -2.1308703 debye
polarizability: 169.9661485|2.1910637|127.6058809|1.6345919|-2.4237626|120.968216 unknown
InChI: InChI=1S/C11H21NO4/c1-3-4-5-6-7-10-15-8-11(2,9-16-10)12(13)14/h10H,3-9H2,1-2H3
charge 0 multiplicity 1
37 atoms
O  -1.388119 -1.368716 0.112224
O  -0.643238 0.885826 -0.283875
O  -3.972478 -0.154124 1.734718
O  -3.285709 1.978912 1.351603
N  -3.450618 0.756596 0.997241
C  -3.081256 0.373302 -0.481829
C  -0.335211 -0.535597 -0.477793
C  -2.681533 -1.119357 -0.532935
C  -1.897246 1.2507 -0.949779
C  0.972475 -0.846125 0.233811
C  2.183755 -0.11005 -0.380036
C  3.499652 -0.417988 0.368447
C  -4.355371 0.651219 -1.308751
C  4.724909 0.30318 -0.236581
C  6.041833 0.004974 0.516034
C  7.262361 0.726221 -0.095636
H  -0.295699 -0.738221 -1.578503
H  -3.411409 -1.742378 0.003078
H  -2.641715 -1.417359 -1.604449
H  -1.802149 1.123168 -2.051273
H  -2.071022 2.308778 -0.707551
H  1.124613 -1.941334 0.19613
H  0.849539 -0.566842 1.296726
H  2.29498 -0.398944 -1.446767
H  1.990012 0.979345 -0.364413
H  3.680544 -1.513566 0.364672
H  3.390999 -0.124372 1.433244
H  -4.176216 0.402416 -2.369424
H  -5.199798 0.039669 -0.946291
H  -4.639171 1.716053 -1.244819
H  4.543513 1.398307 -0.235897
H  4.838062 0.007552 -1.300976
H  5.928936 0.302908 1.578451
H  6.220113 -1.089931 0.51811
H  8.189937 0.497626 0.460923
H  7.121601 1.823629 -0.081615
H  7.415926 0.422023 -1.148423
