program: Gaussian 09
title: 000019183
version: EM64L-G09RevD.01
frameworkgroup: C1[X(C11H14Cl3N)]
method: RPBEPBE
basis: SDD
operation: Freq
keyword: #p
keyword: freq=noraman
keyword: PBEPBE/SDD
title: #p freq=noraman PBEPBE/SDD
converged: YES YES NO NO
title: Mulliken charges:
elementType: Cl Cl Cl N C C C C C C C C C C C H H H H H H H H H H H H H H
charge: -0.068158 -0.069235 -0.053684 -0.131672 -0.534038 -0.323423 -0.326597 0.495155 -0.582811 -0.575258 -0.361847 -0.445109 -0.206705 -0.197777 -0.112691 0.233926 0.221897 0.250491 0.232576 0.235285 0.235895 0.279404 0.261774 0.268131 0.264856 0.254267 0.241130 0.256855 0.257366
chargesum: 0.00000
title: Mulliken charges with hydrogens summed into heavy atoms:
elementType: Cl Cl Cl N C C C C C C C C C C C
charge: -0.068158 -0.069235 -0.053684 -0.131672 -0.078215 0.159644 0.144583 0.495155 -0.041633 -0.042271 -0.107580 -0.203980 0.050150 0.059589 -0.112691
polarizability: 2.09290375e+02 1.28866702e+01 1.25829231e+02 -5.27534918e+00 -5.14050889e-01 1.28568010e+02
1716.lowfreq: -6.3994 -0.9305 -0.0035 -0.0029 -0.0026 1.9135 20.1389 26.1130 30.7744
frequency: 20.0918 25.9518 30.5651 35.1376 72.8500 81.6562 89.4764 135.2909 150.5324 193.5435 210.6733 251.4300 265.4326 294.1059 346.5318 359.2061 389.9121 410.9730 436.7429 473.1088 518.2372 624.8920 650.4665 668.5826 672.4368 709.7032 773.1939 778.5289 796.1706 827.6431 835.8135 845.2706 945.0670 971.5614 980.0192 997.0735 1002.1172 1003.3473 1061.1331 1064.2576 1071.2762 1088.3771 1105.6875 1117.2395 1178.3322 1179.2950 1209.6821 1231.7956 1244.3679 1252.7137 1264.4756 1282.6549 1298.2660 1304.8583 1356.0558 1361.1339 1369.8618 1385.6183 1401.1718 1450.2452 1452.0920 1468.2304 1473.9830 1478.5672 1481.6134 1588.3647 1601.2716 2885.6656 2937.9088 2946.6845 3002.2197 3053.2459 3055.5295 3058.5199 3064.7320 3127.8024 3141.8177 3144.5178 3146.9290 3168.6266 3172.2770
redmass: 11.4466 6.7692 7.7904 4.6390 2.6166 6.1375 2.3996 5.6369 3.6715 4.6765 7.2406 4.0308 4.5114 5.4451 3.3588 3.5108 4.5309 2.9130 3.7563 3.5353 3.4768 7.0044 5.5678 6.1579 5.8846 3.7559 1.1635 1.1511 2.5904 1.8799 1.2553 3.6977 1.3914 1.4331 1.8105 1.8887 2.5309 1.5270 3.4275 2.8415 2.7511 1.7608 1.4417 1.5932 1.1426 1.3947 2.6070 1.5568 1.2058 1.3257 1.3541 1.1620 1.3072 1.2817 1.8952 1.3456 1.4751 3.8776 2.0079 1.0907 1.0945 1.3149 1.1370 1.4776 1.1660 7.3978 6.2328 1.0702 1.0687 1.0682 1.0881 1.0874 1.0647 1.0630 1.0852 1.0898 1.0890 1.1119 1.1112 1.0954 1.0959
irintensity: 0.3958 0.7365 1.0285 0.9580 1.8162 0.5910 1.8831 1.9282 0.8221 7.5113 2.2918 0.9367 0.3767 1.6535 4.0815 4.5090 16.7326 0.6271 1.7999 24.3466 9.1695 0.4355 50.6974 43.8793 95.3958 3.1855 9.3714 10.6188 25.3074 48.9142 2.3995 13.7642 6.4563 4.1454 13.1907 39.8938 21.9311 4.6592 3.9941 10.6737 37.4136 33.5686 20.4577 22.0554 2.2484 6.0975 0.8610 27.1888 22.4132 14.9161 1.2754 7.9724 7.2131 13.5351 15.1237 1.5696 1.6019 3.6888 11.6323 5.0658 5.6529 51.1999 10.3814 14.6256 33.1977 2.5712 10.2094 69.2316 36.6646 61.8355 17.0856 10.9485 9.1772 26.3895 18.8723 9.9295 7.0992 15.7505 18.2806 6.2975 1.1693
temp: 298.150 k
press: 1.00000 atm
elementType: 17 17 17 7 6 6 6 6 6 6 6 6 6 6 6 1 1 1 1 1 1 1 1 1 1 1 1 1 1
symmnumber: 1
zpe: 595754.9 jmol-1
zpe.correction: 0.226911 hartree
zpe.thermalcorrener: 0.243171 hartree
zpe.thermalcorrenthalpy: 0.244115 hartree
zpe.thermalcorrgfe: 0.178366 hartree
zpe.sumelectzpe: -1861.347219 hartree
zpe.sumelectthermal: -1861.330959 hartree
zpe.sumelectthermalent: -1861.330015 hartree
zpe.sumelectthermalfe: -1861.395764 hartree
dipole: 0.0637 -1.4457 1.6226
dipole: 2.1742
quadrupole: -132.7615 -127.5365 -102.1006
quadrupole: -3.3203 1.4308 -1.3575
quadrupole: -11.9620 -6.7370 18.6989 -3.3203 1.4308 -1.3575
hfenergy: -1861.5741299 hartree
pointgroup: C01 [X(C11H14Cl3N1)]
dipole: 0.049024 -0.4083624 0.7500227 debye
polarizability: 207.6378272|16.3043706|127.4101962|-7.9578968|-0.3300797|128.6395925 unknown
InChI: InChI=1S/C11H14Cl3N/c12-5-7-15(8-6-13)9-10-1-3-11(14)4-2-10/h1-4H,5-9H2
charge 0 multiplicity 1
29 atoms
Cl -1.872093 3.816688 -1.334029
Cl -4.797926 -2.549746 -0.29746
Cl 5.18692 -0.209922 -0.904984
N  -1.615644 0.03422 0.344401
C  -0.590625 -0.566358 1.229934
C  -1.570064 1.51016 0.237004
C  -2.965606 -0.558607 0.4727
C  0.831233 -0.436073 0.690457
C  -1.830747 1.927556 -1.216512
C  -3.105391 -1.725764 -0.515521
C  1.113964 -0.688738 -0.675812
C  1.90076 -0.105526 1.557406
C  2.434458 -0.622887 -1.170017
C  3.231201 -0.036094 1.08308
C  3.475988 -0.298776 -0.277403
H  -0.83794 -1.641522 1.332784
H  -0.63263 -0.137698 2.260186
H  -0.565142 1.859845 0.530758
H  -2.304153 2.007673 0.90886
H  -3.730791 0.203464 0.240758
H  -3.172408 -0.91566 1.505127
H  -1.024538 1.595514 -1.885638
H  -2.810912 1.591904 -1.588686
H  -3.063545 -1.386084 -1.560451
H  -2.365422 -2.520991 -0.338219
H  0.286939 -0.929434 -1.352602
H  1.701371 0.102457 2.615678
H  2.651132 -0.819701 -2.224144
H  4.054809 0.221798 1.754945
