program: Gaussian 09
title: 000221965
version: EM64L-G09RevD.01
frameworkgroup: C1[X(C8H13ClO2)]
method: RPBEPBE
basis: SDD
operation: Freq
keyword: #p
keyword: freq=noraman
keyword: PBEPBE/SDD
title: #p freq=noraman PBEPBE/SDD
converged: YES YES NO NO
title: Mulliken charges:
elementType: Cl O O C C C C C C C C H H H H H H H H H H H H H
charge: -0.068905 -0.273668 -0.251450 -0.021806 -0.452242 -0.442570 -0.435900 -0.430299 0.259533 -0.461056 -0.564159 0.262413 0.203074 0.242327 0.235524 0.230114 0.227858 0.221790 0.218518 0.216492 0.264856 0.262912 0.277838 0.278805
chargesum: 0.00000
title: Mulliken charges with hydrogens summed into heavy atoms:
elementType: Cl O O C C C C C C C C
charge: -0.068905 -0.273668 -0.251450 0.240608 -0.006841 0.023067 0.013748 0.004711 0.259533 0.066712 -0.007516
polarizability: 1.27540370e+02 2.66532515e+00 9.05100164e+01 -1.58209911e+00 1.22288425e-02 7.63478096e+01
1716.lowfreq: -29.7773 -11.2744 -7.5435 -0.0015 -0.0009 -0.0009 17.8844 34.6654 36.4677
frequency: -12.1310 34.0108 36.1368 50.4003 86.2309 117.5138 176.5353 212.1392 251.7430 317.7718 383.9464 441.4969 556.7234 565.0371 617.7473 675.3944 729.3894 767.6722 779.4747 795.6509 849.2708 883.2553 897.8573 905.2139 935.7479 947.4597 992.1125 1013.2111 1061.3135 1079.1986 1088.7118 1127.6575 1137.0476 1161.7591 1164.7778 1195.5970 1218.0877 1255.6766 1256.6271 1262.4274 1285.6977 1304.9772 1313.0995 1318.0805 1328.1041 1345.2181 1446.9699 1449.7645 1456.5339 1461.2094 1469.4969 1483.6830 1621.5758 2999.2170 2999.4301 3008.2859 3017.4773 3021.9246 3056.2640 3066.4203 3071.4663 3073.0464 3079.1559 3082.3128 3091.0082 3162.8832
redmass: 2.4782 2.5251 4.0792 4.3027 4.5341 3.3030 2.4288 6.9176 4.6321 3.3729 3.0739 3.0295 2.8697 1.9950 6.4195 2.9107 3.9591 2.8475 1.2744 2.1179 2.0279 3.8869 2.8074 2.3105 1.5053 3.0930 1.5411 1.4868 1.9271 3.9252 1.6454 1.2017 2.4543 1.5409 1.5879 1.4186 1.4123 1.2884 1.2875 1.1519 1.3310 1.2504 1.3306 1.4782 1.4469 1.6605 1.0944 1.0884 1.0810 1.0977 1.0852 1.0975 9.6225 1.0620 1.0641 1.0624 1.0612 1.0635 1.0955 1.0933 1.1000 1.1019 1.0572 1.1008 1.1038 1.1113
irintensity: 0.1072 0.0200 0.2084 2.0253 0.8046 7.0976 3.3158 7.9856 8.8082 1.6627 6.7354 0.4950 1.8721 2.2605 38.0101 7.4430 14.6510 25.9593 13.3191 16.0028 6.1143 4.1446 6.5899 4.8690 33.5853 34.2097 0.8573 2.1819 6.7521 15.8930 5.3535 13.2269 328.3243 7.6768 9.9410 2.4713 2.7700 37.3784 11.7317 0.9208 0.3932 0.3408 4.4325 1.3257 55.4532 62.2993 28.0672 17.3205 5.3932 9.5324 10.3419 7.2866 177.3872 32.3542 26.4384 36.9009 7.1432 22.5247 29.5921 3.0124 1.9982 18.8530 10.2635 12.9367 86.3598 9.8539
temp: 298.150 k
press: 1.00000 atm
elementType: 17 8 8 6 6 6 6 6 6 6 6 1 1 1 1 1 1 1 1 1 1 1 1 1
symmnumber: 1
zpe: 520622.7 jmol-1
zpe.correction: 0.198295 hartree
zpe.thermalcorrener: 0.209503 hartree
zpe.thermalcorrenthalpy: 0.210447 hartree
zpe.thermalcorrgfe: 0.158401 hartree
zpe.sumelectzpe: -922.292417 hartree
zpe.sumelectthermal: -922.281209 hartree
zpe.sumelectthermalent: -922.280265 hartree
zpe.sumelectthermalfe: -922.332311 hartree
dipole: 3.3947 -0.5261 -0.1660
dipole: 3.4393
quadrupole: -77.9418 -78.0912 -70.7135
quadrupole: -1.2469 0.2815 0.5959
quadrupole: -2.3596 -2.5091 4.8687 -1.2469 0.2815 0.5959
hfenergy: -922.4907119 hartree
pointgroup: C01 [X(C8H13Cl1O2)]
dipole: 1.3449969 0.1096277 0.099418 debye
dipolederiv: -0.5357773 0.0848893 -0.1243018 0.1558406 -0.2348703 0.0688353 -0.1891182 0.0583594 -0.2589095 -1.8123888 -0.152183 -0.0825641 -0.2614746 -0.4917335 0.0615487 -0.1454975 0.0693797 -0.3507932 -0.8076116 0.0012139 -0.0662003 -0.3562963 -0.6809749 0.2318474 0.1630877 0.2801887 -0.481415 0.8628037 -0.0372316 0.0511552 -0.2098825 0.2913634 0.0208269 0.3054567 0.052695 0.2926748 0.0088942 -0.0166402 0.0550978 -0.0634182 -0.0251442 -0.0649183 -0.010695 -0.0222103 0.0688382 -0.0024737 -0.0092687 0.0229884 0.0432577 -0.0454501 -0.074884 -0.0091505 -0.1031046 0.0288747 0.1001997 -0.025389 0.0652819 0.0017778 0.0377201 -0.0101424 0.0052323 -0.0254374 0.0526563 0.123187 -0.0303138 0.0312146 0.0005113 0.0063852 0.0039671 0.089248 -0.0085733 0.0960688 1.8669131 0.1462353 0.137379 0.5922372 0.8423361 -0.3988074 -0.0739895 -0.4425808 0.4944831 -0.2473122 0.0384228 -0.0840713 0.2072458 -0.1100572 0.1875726 -0.2322679 0.163206 -0.0727171 0.6354598 -0.182613 0.2120966 -0.19439 0.2656672 -0.088953 0.2354529 -0.0879019 0.3150007 -0.0619804 -0.0068789 0.0833086 0.039891 0.0450242 0.056855 0.0036172 0.0193992 -0.0808277 -0.0779423 -0.0017427 -0.112243 0.018535 0.0765033 0.0747491 -0.0792843 0.0338066 -0.0717821 0.0671778 0.0909186 0.0435922 0.0694454 -0.1008766 -0.0751104 0.0530546 -0.0389126 0.0579759 -0.0502654 -0.0627598 -0.0736669 -0.0665928 0.0525197 -0.0200947 -0.0929911 -0.0594919 -0.0078694 0.0159296 0.0260622 -0.0058779 0.0510318 -0.0636824 0.0906877 0.010403 0.126225 0.0037925 -0.1483269 -0.129725 0.0410776 -0.111268 0.0016254 0.0162789 0.0265865 0.0015057 0.0741456 0.0250958 0.0873195 -0.1077422 0.0585125 0.0131232 0.0428878 -0.0805841 0.0564539 -0.0619143 0.0552252 0.0008149 0.0183107 0.0158564 0.0325551 -0.0789469 0.0724116 -0.0876379 -0.1515706 -0.1365332 0.0717572 -0.0558544 0.0513235 0.0145183 0.0332364 -0.1156541 0.0637123 0.0244167 0.0586714 -0.0038742 -0.0268951 -0.0410802 -0.0345352 -0.0489655 0.0087126 -0.0542718 0.0985344 0.0407454 0.0157592 0.038937 -0.027947 0.1121089 -0.0145407 0.0656444 0.0056779 -0.0347555 0.0020808 0.0421974 -0.0177737 0.0220285 0.0716107 0.0146985 0.0260964 0.0236661 -0.0863041 0.0182284 0.0530298 -0.0432489 0.0048552 -0.0757365 -0.0286282 -0.0357716 -0.0241532 0.051397 unknown
polarizability: 125.9817399|-3.6985372|87.0066794|7.4918884|-7.0029792|81.4097766 unknown
InChI: InChI=1S/C8H13ClO2/c9-6-5-8(10)11-7-3-1-2-4-7/h7H,1-6H2
charge 0 multiplicity 1
24 atoms
Cl -4.778376 0.79963 -1.199107
O  0.227697 0.475849 0.111853
O  -1.135789 -1.205747 0.989272
C  1.429517 -0.1243 0.810925
C  2.499538 0.979411 0.814722
C  2.01789 -1.287663 -0.037319
C  3.193284 0.828273 -0.561821
C  3.288646 -0.712306 -0.743804
C  -0.986331 -0.173307 0.290988
C  -2.094168 0.545851 -0.469554
C  -3.447923 -0.125253 -0.228671
H  1.087727 -0.446176 1.80893
H  3.220796 0.767446 1.628318
H  2.062481 1.975791 0.994923
H  1.264302 -1.637057 -0.76373
H  2.259322 -2.15025 0.608167
H  4.177541 1.326413 -0.603956
H  2.55387 1.270669 -1.348254
H  3.345629 -1.007405 -1.8059
H  4.202519 -1.090509 -0.248013
H  -2.117962 1.605017 -0.15589
H  -1.844949 0.548697 -1.546688
H  -3.758527 -0.084258 0.824125
H  -3.475135 -1.162416 -0.589016
