program: Gaussian 09
title: 000221962
version: EM64L-G09RevD.01
frameworkgroup: C1[X(C6H13NO2)]
method: RPBEPBE
basis: SDD
operation: Freq
keyword: #p
keyword: freq=noraman
keyword: PBEPBE/SDD
title: #p freq=noraman PBEPBE/SDD
converged: YES YES NO NO
title: Mulliken charges:
elementType: O O N C C C C C C H H H H H H H H H H H H H
charge: -0.270854 -0.447122 -0.398428 -0.198705 0.253065 -0.680723 -0.679938 -0.358574 -0.313627 0.194168 0.223625 0.237777 0.214121 0.215354 0.245521 0.209316 0.245792 0.215671 0.303671 0.221395 0.233297 0.335198
chargesum: 0.00000
title: Mulliken charges with hydrogens summed into heavy atoms:
elementType: O O N C C C C C C
charge: -0.270854 -0.111923 -0.094756 -0.004537 0.253065 -0.005727 -0.009160 0.102828 0.141065
polarizability: 9.34634962e+01 -3.80515622e+00 7.02205037e+01 -2.06535920e+00 -2.55547390e+00 7.09218292e+01
1716.lowfreq: -10.7509 -7.8603 -0.0008 -0.0007 0.0001 7.7626 18.7287 50.9047 69.4990
frequency: 18.4104 50.8970 69.4875 120.5739 196.3829 199.2415 226.3185 255.0995 281.3285 292.7475 313.9470 357.4723 448.9219 526.5853 563.2362 638.3967 728.0525 800.0748 848.7931 869.4916 921.9075 922.7160 963.7586 999.8995 1063.9873 1078.4709 1095.7482 1108.0876 1173.7043 1179.9706 1204.0620 1264.3806 1289.9446 1328.1605 1343.2894 1353.8545 1371.3600 1376.3136 1394.4692 1425.9526 1461.8974 1468.4773 1471.1705 1472.6863 1477.2045 1492.7466 1617.4400 2968.4041 2981.9826 2985.1483 2998.6556 3009.3406 3075.8801 3078.9670 3081.1627 3090.6393 3091.6956 3096.6255 3557.0688 3559.2264
redmass: 3.3696 4.9691 4.4121 2.4663 2.5612 1.0712 1.7561 1.6405 2.3576 2.8178 1.4929 2.2011 2.5692 2.2208 1.1902 2.8910 5.9926 2.7219 2.5381 3.0530 1.8507 1.2250 1.4746 2.7599 2.3818 1.9230 1.7344 2.5235 1.3692 1.8590 1.9085 1.2206 1.3654 1.1704 1.5995 1.3298 1.2132 1.1907 1.1977 1.1692 1.0438 1.1202 1.5846 1.0502 1.0701 1.0950 6.0264 1.0817 1.0352 1.0373 1.0640 1.0599 1.1005 1.1018 1.0998 1.1008 1.1035 1.1001 1.0667 1.0773
irintensity: 0.1677 10.8553 3.1812 3.2842 1.5648 1.2955 5.0223 11.3835 51.4219 4.8346 113.8204 44.8589 6.3960 0.3784 52.7123 2.0563 3.0942 8.5395 19.3688 12.4894 16.7892 7.7824 0.2446 74.2769 10.5302 12.5376 11.6660 0.2472 29.5398 5.5439 67.3303 14.9070 0.3975 15.4406 9.9516 5.7107 25.2518 15.8705 11.7534 38.5675 4.8511 25.4053 164.2631 2.5899 10.0198 46.9479 119.1406 38.5400 37.5763 21.2098 30.7146 28.7669 26.4212 15.7664 51.3415 3.5971 36.6186 40.8352 1.0437 18.7527
temp: 298.150 k
press: 1.00000 atm
elementType: 8 8 7 6 6 6 6 6 6 1 1 1 1 1 1 1 1 1 1 1 1 1
symmnumber: 1
zpe: 494667.3 jmol-1
zpe.correction: 0.188409 hartree
zpe.thermalcorrener: 0.199780 hartree
zpe.thermalcorrenthalpy: 0.200724 hartree
zpe.thermalcorrgfe: 0.150083 hartree
zpe.sumelectzpe: -440.894580 hartree
zpe.sumelectthermal: -440.883209 hartree
zpe.sumelectthermalent: -440.882265 hartree
zpe.sumelectthermalfe: -440.932906 hartree
dipole: -1.4253 0.2503 -3.0722
dipole: 3.3960
quadrupole: -61.8195 -55.2078 -56.7561
quadrupole: -6.9495 3.2672 1.8930
quadrupole: -3.8917 2.7200 1.1717 -6.9495 3.2672 1.8930
hfenergy: -441.0829889 hartree
pointgroup: C01 [X(C6H13N1O2)]
dipole: 0.6231725 0.2498961 1.1551368 debye
dipolederiv: -0.6474116 -0.1170241 -0.0320574 -0.0217183 -0.4762016 -0.2180728 0.2246847 -0.1453771 -0.8425403 -0.3096345 0.2335758 -0.056722 0.3240824 -0.6985022 -0.0316273 -0.0310939 -0.0481007 -0.5652412 -1.0554673 -0.0179927 0.2911581 -0.0136663 -0.4565508 0.0719623 0.3078708 0.0853424 -0.5640392 -0.1546014 -0.1109364 -0.0234425 -0.1182632 0.020411 0.0056806 -0.0130416 0.0073938 0.1328614 1.2140718 0.2820988 -0.3533267 0.235584 0.322028 0.2381318 -0.5847486 0.204312 1.0480958 0.0144132 0.0551157 0.0187805 -0.0279679 -0.007738 -0.018606 -0.0231666 -0.0126759 0.0397714 0.0196935 -0.0153047 0.005935 0.013922 0.0106469 0.051184 -0.0553998 0.0032212 0.0043156 0.4421254 0.133914 0.0083397 0.1956396 0.2064516 -0.0614442 0.0323222 0.0437688 0.142177 0.2670148 -0.1018132 -0.0093445 -0.1810508 0.5335487 0.1640297 -0.0137747 0.0746255 0.3317922 0.0054944 0.0180485 0.0692473 0.0097396 0.0086308 -0.0496738 0.0469197 -0.0572816 -0.1892853 -0.0188525 -0.0423985 0.0374893 -0.04788 0.0923616 0.0354714 0.0539559 0.0926578 -0.1034009 0.0204953 0.081576 0.0256108 -0.0090349 -0.064263 -0.0440705 -0.0412552 -0.1038669 0.0722767 -0.1417596 -0.080954 -0.0531737 -0.1107927 0.0196802 -0.0391266 -0.0484567 -0.0297415 0.0892429 0.0830912 -0.0118424 0.0330866 0.0249991 -0.0851613 0.1248408 0.0007477 0.1368574 -0.0073133 0.1047583 0.0120892 -0.0123063 0.0284312 0.0756253 -0.0403954 0.0580156 -0.072758 -0.0791815 -0.059632 0.161375 0.0115169 0.1233348 -0.0404812 0.0185269 0.0253117 -0.0043774 0.0769534 0.1103518 0.0023539 0.0122345 0.025012 0.0721544 -0.0861274 0.030368 -0.013615 -0.0854177 -0.1089767 -0.1400163 -0.045294 -0.1170427 0.0086278 -0.0040703 -0.0508124 -0.0136311 0.0719194 0.1623379 -0.0659429 -0.0125303 -0.1022075 0.2346251 -0.0668504 -0.0118242 -0.066188 0.1425213 -0.122929 -0.1085736 -0.0354479 -0.0615896 -0.0141105 -0.0518889 -0.0210547 -0.0326543 0.0957222 0.0606605 0.0204448 0.1144801 0.0135611 -0.0113496 0.0286715 0.0661085 0.0097833 -0.115893 0.1147564 -0.1877928 0.0057665 -0.1830918 0.249567 -0.0265455 0.0483237 -0.0576947 0.304663 unknown
polarizability: 92.2236957|5.6346648|71.4414938|-4.1103897|1.9798894|70.9406396 unknown
InChI: InChI=1S/C6H13NO2/c1-5(2)6(9)7-3-4-8/h5,7-8H,3-4H2,1-2H3
charge 0 multiplicity 1
22 atoms
O  0.410366 -0.6702 -1.333576
O  -3.212477 1.022747 0.38397
N  -0.501365 -0.235202 0.756536
C  1.77967 0.618603 0.260536
C  0.520278 -0.147858 -0.18162
C  3.006761 -0.323912 0.178346
C  1.97055 1.858413 -0.65025
C  -1.740778 -0.990933 0.484052
C  -2.757837 -0.175372 -0.338368
H  1.657044 0.959208 1.309833
H  -2.191075 -1.272356 1.452261
H  -1.478544 -1.908659 -0.074962
H  3.929595 0.220744 0.44821
H  2.902878 -1.188904 0.858501
H  3.11079 -0.708692 -0.851122
H  1.123008 2.563641 -0.566589
H  2.046283 1.537641 -1.704003
H  2.895824 2.398074 -0.378538
H  -0.351342 0.150234 1.689712
H  -3.669129 -0.774061 -0.501361
H  -2.317688 0.085707 -1.32056
H  -2.444114 1.643836 0.460491
