program: Gaussian 09
title: 000221961
version: EM64L-G09RevD.01
frameworkgroup: C1[X(C5H11NO)]
method: RPBEPBE
basis: SDD
operation: Freq
keyword: #p
keyword: freq=noraman
keyword: PBEPBE/SDD
title: #p freq=noraman PBEPBE/SDD
converged: YES YES NO NO
title: Mulliken charges:
elementType: O N C C C C C H H H H H H H H H H H
charge: -0.282587 -0.383756 -0.186242 -0.680407 -0.681572 0.264339 -0.606220 0.189728 0.211965 0.214432 0.244178 0.210366 0.214740 0.245831 0.299474 0.223740 0.224406 0.277586
chargesum: 0.00000
title: Mulliken charges with hydrogens summed into heavy atoms:
elementType: O N C C C C C
charge: -0.282587 -0.084283 0.003485 -0.009832 -0.010635 0.264339 0.119513
polarizability: 7.81993682e+01 -9.24583878e-01 5.47973289e+01 3.82262441e+00 -1.73958135e+00 6.10810329e+01
1716.lowfreq: -12.6203 -4.7109 -0.0008 -0.0008 -0.0005 7.5316 30.8803 110.7890 148.6533
frequency: 30.6991 110.7845 148.6459 196.3945 203.7514 253.1771 274.6944 296.8091 334.5353 472.9200 570.2946 632.9006 724.0101 817.1682 894.9403 921.1316 962.3526 1040.3882 1088.6667 1105.8531 1124.1853 1135.8577 1181.0639 1208.8079 1290.0749 1345.4813 1372.6835 1391.3341 1415.6463 1453.7534 1460.3977 1472.4039 1476.4797 1487.6469 1491.2432 1511.2578 1624.2136 2967.9063 2976.8560 2981.5895 2984.6125 3056.2562 3076.0030 3080.2356 3090.0429 3096.3501 3106.1231 3558.8828
redmass: 3.5402 1.0624 2.6432 1.0834 1.6734 1.3871 3.4868 2.9065 3.3815 2.9802 1.1097 2.8356 6.5747 2.8746 2.5870 1.1525 1.4651 3.5335 1.4476 2.1956 1.4027 1.6681 2.0640 1.9317 1.3696 1.6274 1.1920 1.1992 1.1786 1.3362 1.0437 1.0503 1.0498 1.0460 1.0560 1.4270 5.9925 1.0807 1.0351 1.0348 1.0375 1.1025 1.1007 1.0999 1.1007 1.0998 1.0982 1.0776
irintensity: 5.5018 0.2289 0.0447 0.5427 2.5050 1.3626 10.6712 5.1659 14.0770 0.7094 112.9336 0.0692 1.5900 4.4435 1.5046 6.3573 0.2572 24.7941 20.4499 0.3021 0.3574 47.7436 3.4794 72.3952 0.2401 5.7897 15.6551 17.5981 29.7620 80.4679 4.2861 3.7143 18.3709 15.8594 20.3609 113.6238 138.5573 47.1651 71.0498 37.9701 19.3726 38.4826 24.6727 52.6853 4.9289 40.5808 2.3475 14.3734
temp: 298.150 k
press: 1.00000 atm
elementType: 8 7 6 6 6 6 6 1 1 1 1 1 1 1 1 1 1 1
symmnumber: 1
zpe: 409706.1 jmol-1
zpe.correction: 0.156049 hartree
zpe.thermalcorrener: 0.165110 hartree
zpe.thermalcorrenthalpy: 0.166055 hartree
zpe.thermalcorrgfe: 0.122052 hartree
zpe.sumelectzpe: -326.539435 hartree
zpe.sumelectthermal: -326.530373 hartree
zpe.sumelectthermalent: -326.529429 hartree
zpe.sumelectthermalfe: -326.573431 hartree
dipole: -0.6638 0.8456 -3.7561
dipole: 3.9069
quadrupole: -37.9250 -44.4050 -46.2946
quadrupole: -0.5042 2.3894 0.4968
quadrupole: 4.9499 -1.5301 -3.4197 -0.5042 2.3894 0.4968
hfenergy: -326.6954834 hartree
pointgroup: C01 [X(C5H11N1O1)]
dipole: -0.2557351 -0.9676887 1.1665512 debye
dipolederiv: -0.669618 0.0657464 -0.057432 -0.1135528 -0.6280886 0.3007469 0.1558438 0.2953463 -0.7360917 -0.9942458 -0.215992 0.2946713 -0.1395993 -0.4731558 0.0021693 0.2084594 0.007126 -0.5038493 -0.1828084 0.0565028 -0.0423816 0.0643248 0.090593 -0.0181751 -0.0379502 -0.0189067 0.1210102 0.0228912 0.0118219 0.0340156 0.0032652 0.0312737 -0.0395498 -0.0431893 -0.0094257 -0.0144827 0.0238121 -0.0466693 -0.0013735 0.0285446 -0.0252127 0.0042745 -0.016767 -0.0177798 0.03946 1.2783292 0.1346245 -0.2565369 0.2531053 0.5494163 -0.5332826 -0.3954561 -0.5312502 0.7694205 0.421434 0.0173498 -0.0262142 -0.1370584 0.1645297 0.1552165 0.1561568 0.1438216 0.1072015 0.0009581 -0.0447916 0.0602542 -0.0288547 -0.0605426 0.1113093 0.0370194 0.111671 -0.1258191 -0.1609772 0.1007505 -0.0435736 0.0810383 0.0680458 0.0005399 -0.0596713 0.0116223 0.0554221 0.0270004 -0.131196 -0.0341765 -0.0919413 -0.098149 -0.0854865 -0.0149803 -0.0649188 0.0544495 0.1070512 0.0044709 0.0133298 -0.0351631 0.0206513 0.1211072 0.0413619 0.0590686 -0.0372106 -0.1702133 0.040821 -0.0827888 0.0659248 0.0514624 0.018552 -0.0682413 0.0072718 0.0822072 0.0543963 0.049451 0.0977112 0.0221942 -0.0000136 -0.1080082 0.0615103 -0.1260705 -0.0707004 0.1119905 -0.0087523 -0.0059621 -0.033928 0.017092 0.0636851 0.0455313 0.1185659 -0.0270932 0.1302371 0.0405768 -0.0363575 0.0485418 0.2323691 0.1165071 -0.0473372 0.1167596 0.1956703 -0.0757299 0.0341176 0.0698719 0.0872138 0.0721767 -0.099641 0.1133042 -0.109775 -0.061435 -0.0931533 -0.0761802 -0.0171316 -0.129317 -0.0787072 -0.0775255 -0.0660108 -0.0672379 0.1036801 0.1686458 -0.0326516 0.0340742 0.0552619 0.0662595 0.0675608 -0.0695836 0.0741115 0.0481606 unknown
polarizability: 78.123017|1.7441187|57.4069003|-3.7549209|-3.5270959|58.5478127 unknown
InChI: InChI=1S/C5H11NO/c1-4(2)5(7)6-3/h4,6H,1-3H3
charge 0 multiplicity 1
18 atoms
O  -0.412369 0.855009 -1.132048
N  -1.376844 -0.469777 0.523464
C  1.09418 -0.444906 0.317449
C  1.777119 -1.246854 -0.820504
C  1.954824 0.775194 0.729642
C  -0.284928 0.042475 -0.164734
C  -2.759423 -0.112666 0.18396
H  0.96622 -1.1099 1.197025
H  2.782857 -1.580978 -0.506629
H  1.187481 -2.138355 -1.102635
H  1.880565 -0.607981 -1.715039
H  2.968987 0.450686 1.025916
H  1.504133 1.324352 1.576418
H  2.039784 1.471163 -0.122965
H  -1.207639 -1.11905 1.292641
H  -3.273861 0.364905 1.038478
H  -3.339467 -0.998611 -0.135283
H  -2.713319 0.603995 -0.652057
