program: Gaussian 09
title: 000221947
version: EM64L-G09RevD.01
frameworkgroup: C1[X(C15H30O2)]
method: RPBEPBE
basis: SDD
operation: Freq
keyword: #pfreq=noraman
keyword: PBEPBE/SDD
title: #p freq=noraman PBEPBE/SDD
converged: YES YES NO NO
title: Mulliken charges:
elementType: O O C C C C C C C C C C C C C C C H H H H H H H H H H H H H H H H H H H H H H H H H H H H H H
charge: -0.238878 -0.245151 0.284145 -0.372731 -0.366967 0.018383 -0.444942 -0.379938 -0.697199 -0.734263 -0.378183 -0.386768 -0.381232 -0.372755 -0.353176 -0.356759 -0.696804 0.183501 0.229119 0.228118 0.184496 0.181460 0.225382 0.211955 0.228611 0.181002 0.197684 0.190353 0.258982 0.202287 0.202465 0.219326 0.210627 0.219048 0.191642 0.196313 0.192769 0.191289 0.189877 0.188695 0.187891 0.187236 0.194340 0.194927 0.209767 0.209510 0.214549
chargesum: 0.00000
title: Mulliken charges with hydrogens summed into heavy atoms:
elementType: O O C C C C C C C C C C C C C C C
charge: -0.238878 -0.245151 0.284145 0.039889 0.045646 0.199843 -0.007605 0.029675 -0.033465 -0.085263 0.009854 0.001187 0.002825 0.005817 0.021951 0.032508 -0.062979
polarizability: 2.21444191e+02 -3.05124036e+00 1.47004662e+02 -1.14627861e+00 1.63493620e+00 1.41666811e+02
1716.lowfreq: -13.9822 -2.7072 -0.0017 -0.0010 0.0013 6.1889 16.7960 26.0955 41.7270
frequency: 13.9837 25.9385 39.9733 45.8945 69.8213 79.4486 91.2370 120.3084 121.3210 144.8913 152.2458 153.7394 168.1946 175.2604 205.3754 215.7288 229.6220 249.9134 258.9255 292.6309 300.1542 351.6633 370.3996 400.3371 403.7321 455.8765 463.7127 488.8509 507.7362 549.5792 633.3635 720.8152 724.5683 733.7257 754.9888 771.1854 791.0851 837.7069 876.6721 888.2104 896.4153 899.8454 917.6332 940.0452 941.1933 953.6020 960.3807 982.3851 996.0662 1006.6634 1016.8546 1019.9570 1037.9466 1048.6759 1063.4368 1071.8111 1080.4083 1083.2109 1093.5001 1123.1177 1155.9890 1181.3222 1187.8049 1197.3435 1204.0361 1212.9712 1222.8940 1247.3591 1252.1281 1269.1137 1276.9601 1280.0075 1282.0194 1288.3095 1296.0910 1297.7957 1303.2928 1313.1301 1315.9582 1336.2740 1347.4163 1352.8401 1355.9039 1358.2102 1360.5163 1374.6338 1382.0657 1389.8239 1395.9688 1447.1020 1452.9749 1453.4926 1460.9847 1461.2408 1465.0102 1465.2802 1468.1730 1471.0353 1474.4442 1477.0060 1479.4242 1480.8570 1486.3965 1486.6032 1489.1440 2864.6685 2917.3226 2928.2082 2949.5007 2950.2445 2951.7150 2954.8554 2960.4397 2965.0964 2966.7388 2968.2364 2971.4618 2978.4023 2982.7111 2988.3505 2997.3057 3000.5152 3010.3524 3024.1748 3035.2238 3042.2623 3059.4532 3063.2450 3065.6361 3067.9522 3068.8376 3069.9662 3071.8901 3072.5503 3099.1676
redmass: 3.9326 3.6997 1.7250 3.2713 3.7821 1.7757 2.5804 1.7420 2.9213 2.3895 1.9937 3.5331 1.1138 2.6283 1.8624 1.6418 1.1226 3.2407 2.6054 2.5530 2.7368 2.9444 2.7874 1.9271 2.1717 3.2620 3.5837 4.1754 3.5920 3.8462 3.9356 1.0600 1.0817 1.1800 1.3455 3.5715 1.4796 1.4581 2.9665 1.8980 1.4323 2.2084 2.1162 1.3875 1.4816 4.8208 1.3621 3.9029 3.3918 3.7073 1.1790 1.4157 2.7075 3.0158 2.9096 2.7916 2.0798 2.2143 1.8112 2.7308 1.8588 2.0058 1.9266 1.3471 1.7402 1.3263 1.5222 1.3172 1.3468 2.0240 1.1879 1.2922 1.0829 1.0736 1.1431 1.0998 1.5768 1.3669 1.1715 1.3832 1.2376 1.5112 1.6247 1.4444 1.5196 1.2412 1.6800 1.2181 1.2196 1.0806 1.0847 1.0785 1.0723 1.0743 1.0578 1.0557 1.0782 1.0732 1.0787 1.0424 1.0569 1.0836 1.0905 1.0601 1.0947 1.0825 1.0678 1.0679 1.0586 1.0587 1.0592 1.0596 1.0606 1.0631 1.0357 1.0587 1.0368 1.0368 1.0960 1.0973 1.0971 1.0627 1.1013 1.1023 1.1019 1.1033 1.0987 1.0981 1.0982 1.1007 1.1028 1.0993 1.0967 1.0965 1.0983
irintensity: 0.0868 0.3822 0.0931 0.2994 0.2762 0.0162 0.1310 0.0402 0.2962 0.1504 0.0064 0.1727 0.0752 1.0955 1.7933 0.9465 0.0015 7.0236 0.8350 1.4788 1.0733 1.5055 3.1557 2.2935 1.4803 0.3097 4.2090 1.9969 0.7211 2.6177 7.7328 15.8628 0.1239 1.8491 9.0247 2.9043 8.8908 19.0988 14.1290 4.4905 6.7387 38.5790 4.2079 4.7787 20.5247 16.7102 3.9933 25.5353 20.8565 10.5119 0.8971 0.2552 2.9534 113.3682 2.2625 15.5340 0.1398 2.0712 65.0853 9.5639 21.1035 1.7005 0.4778 1.9411 0.5601 15.2172 0.8150 1.8202 0.5274 1.5144 0.0743 1.5738 0.7067 1.9474 0.4112 1.1109 10.5930 1.4020 3.0924 3.8716 3.0685 2.5383 3.4445 4.5108 0.8651 19.5441 39.9951 11.0109 16.2577 7.0107 4.5785 0.4594 0.0378 0.2423 0.3188 0.4190 0.2298 16.4835 1.7454 12.2224 11.2463 1.0193 2.3136 23.2394 34.3717 68.3953 27.0882 117.9502 0.3830 0.2435 1.9554 0.5995 19.6156 41.1997 44.2283 194.1617 35.6803 30.8520 1.1934 1.1288 1.1252 25.3979 4.3268 1.1173 25.5876 147.3491 23.7106 0.6101 0.5381 76.7730 82.9037 56.0507 79.4913 67.7446 18.9571
temp: 298.150 k
press: 1.00000 atm
elementType: 8 8 6 6 6 6 6 6 6 6 6 6 6 6 6 6 6 1 1 1 1 1 1 1 1 1 1 1 1 1 1 1 1 1 1 1 1 1 1 1 1 1 1 1 1 1 1
symmnumber: 1
zpe: 1112621.5 jmol-1
zpe.correction: 0.423775 hartree
zpe.thermalcorrener: 0.444913 hartree
zpe.thermalcorrenthalpy: 0.445857 hartree
zpe.thermalcorrgfe: 0.371601 hartree
zpe.sumelectzpe: -738.610373 hartree
zpe.sumelectthermal: -738.589235 hartree
zpe.sumelectthermalent: -738.588291 hartree
zpe.sumelectthermalfe: -738.662547 hartree
dipole: 1.5148 -0.8537 -1.4573
dipole: 2.2687
quadrupole: -95.5474 -111.1231 -107.2300
quadrupole: -4.8013 -4.6388 -0.9129
quadrupole: 9.0861 -6.4897 -2.5965 -4.8013 -4.6388 -0.9129
hfenergy: -739.0341481 hartree
pointgroup: C01 [X(C15H30O2)]
dipole: 0.5979856 0.2437882 0.616187 debye
polarizability: 221.4487706|2.9266192|146.3834998|1.3092553|2.3632868|142.2833941 unknown
InChI: InChI=1S/C15H30O2/c1-4-5-6-7-8-9-10-11-14-16-12-15(2,3)13-17-14/h14H,4-13H2,1-3H3
charge 0 multiplicity 1
47 atoms
O  3.580138 -1.427053 -0.192355
O  2.773244 0.847353 -0.094924
C  5.247349 0.445509 -0.08595
C  4.90575 -1.01714 0.313076
C  4.071305 1.328031 0.416442
C  2.539001 -0.536854 0.325852
C  1.19877 -0.994576 -0.233516
C  0.002426 -0.200539 0.334524
C  5.390939 0.56383 -1.621418
C  6.550053 0.879352 0.624705
C  -1.350666 -0.686546 -0.230498
C  -2.55863 0.105303 0.318188
C  -3.915131 -0.388753 -0.233224
C  -5.123813 0.409627 0.305273
C  -6.481172 -0.093092 -0.236288
C  -7.689763 0.70984 0.296953
C  -9.04177 0.196303 -0.24425
H  4.92345 -1.118206 1.422949
H  5.620638 -1.732666 -0.126743
H  4.162539 2.365625 0.053646
H  4.050865 1.33112 1.530966
H  2.573983 -0.569517 1.445324
H  1.240118 -0.893431 -1.334307
H  1.091137 -2.072161 -0.005778
H  0.142619 0.873312 0.10682
H  -0.011759 -0.29025 1.441441
H  -1.3342 -0.608198 -1.337676
H  -1.482456 -1.764285 0.002581
H  4.462201 0.243116 -2.121918
H  5.603472 1.608661 -1.916382
H  6.221069 -0.069606 -1.98685
H  7.400247 0.247433 0.306247
H  6.462512 0.80228 1.725825
H  6.802412 1.927409 0.376354
H  -2.568277 0.038614 1.426514
H  -2.432423 1.180642 0.07326
H  -3.902766 -0.330649 -1.341884
H  -4.043624 -1.462347 0.019334
H  -4.999773 1.481729 0.044403
H  -5.131365 0.35941 1.414503
H  -6.473663 -0.047798 -1.345657
H  -6.608728 -1.163735 0.02912
H  -7.693772 0.667701 1.405513
H  -7.563988 1.778573 0.027652
H  -9.074208 0.255171 -1.34874
H  -9.205631 -0.860785 0.038908
H  -9.888862 0.787144 0.150688
