program: Gaussian 09
title: 000221931
version: EM64L-G09RevD.01
frameworkgroup: C1[X(C14H18O4)]
method: RPBEPBE
basis: SDD
operation: Freq
keyword: #pfreq=noraman
keyword: PBEPBE/SDD
title: #p freq=noraman PBEPBE/SDD
converged: YES YES NO NO
title: Mulliken charges:
elementType: O O O O C C C C C C C C C C C C C C H H H H H H H H H H H H H H H H H H
charge: -0.270149 -0.312232 -0.303227 -0.259223 -0.152600 0.421982 -0.520919 -0.022290 -0.395381 0.231795 -0.222535 -0.368647 -0.002499 0.305935 -0.592082 -0.553085 -0.762352 -0.528961 0.273471 0.228217 0.224791 0.254688 0.227026 0.252038 0.214660 0.214784 0.217576 0.244980 0.282269 0.222018 0.248030 0.251462 0.243992 0.228619 0.258511 0.219336
chargesum: 0.00000
title: Mulliken charges with hydrogens summed into heavy atoms:
elementType: O O O O C C C C C C C C C C C C C C
charge: -0.270149 -0.312232 -0.303227 -0.259223 0.120871 0.421982 -0.067911 -0.022290 -0.140693 0.231795 0.004491 -0.116609 0.212161 0.305935 -0.159722 0.196183 -0.018869 0.177505
polarizability: 2.06782990e+02 5.57359817e+00 1.22325675e+02 -8.64816077e+00 -3.45012461e+00 1.63775075e+02
1716.lowfreq: -6.4297 -3.8502 -0.0003 0.0005 0.0007 3.8746 16.0458 35.4967 44.0217
frequency: 12.7471 35.4711 44.0122 49.1882 62.3417 66.6521 84.8107 98.2266 112.8001 134.8551 147.9813 159.2049 184.8191 190.2219 205.7671 215.5169 265.3367 268.1266 285.9378 350.8597 353.4723 390.7836 419.7348 449.4034 484.7719 533.1096 549.9519 566.9786 584.7477 600.1078 617.5249 644.4250 725.4510 756.8433 781.5137 785.2363 806.4309 884.5092 903.6829 910.2446 925.5704 932.3059 942.0023 960.3451 970.9637 994.7800 996.7940 1002.8647 1042.9422 1057.9344 1063.7307 1114.3105 1128.3047 1134.0317 1147.5004 1155.1943 1167.6012 1173.3020 1206.4798 1221.4094 1234.5014 1255.9889 1273.0387 1293.1949 1310.2271 1336.3353 1368.7915 1381.7601 1419.1559 1425.9578 1430.0324 1445.4281 1449.4742 1452.6081 1455.3246 1459.0801 1460.7548 1467.9590 1484.2264 1489.4603 1589.4146 1595.0297 1640.8411 1663.6746 2973.2919 2978.2212 2985.8222 3005.1299 3042.7175 3061.7252 3073.2432 3076.8112 3093.4039 3095.0630 3097.8045 3122.4648 3123.1129 3133.4229 3140.3796 3151.1303 3169.0353 3195.8804
redmass: 1.0411 4.7736 5.9692 3.2369 3.5308 3.5896 3.1191 3.0558 3.3033 2.8728 3.0554 1.1499 3.2039 1.1249 3.4794 4.2789 4.3879 5.5235 3.9127 4.4703 3.0658 3.1267 4.4011 3.1184 3.9168 4.8117 3.6023 3.4350 4.6814 3.7002 2.3180 3.0359 5.4265 2.0711 3.6957 4.2186 2.2528 4.4754 1.4808 5.9002 1.6026 6.0837 1.4989 2.4908 1.3321 3.0394 2.0390 1.2924 1.6641 2.0649 2.1009 1.2375 1.2497 2.3000 1.6111 1.3572 1.9870 1.3429 3.2427 1.3623 2.0563 2.1849 1.5314 1.2562 1.3921 1.5123 4.5369 1.2456 1.3512 1.1631 1.3378 1.1297 1.8820 1.0598 1.0586 1.1359 1.9870 1.0871 1.0598 1.0536 7.1483 6.5158 9.4005 4.8066 1.0319 1.0622 1.0286 1.0379 1.0937 1.0870 1.1020 1.0778 1.0768 1.1058 1.0949 1.1033 1.1044 1.0861 1.1020 1.0925 1.0986 1.1146
irintensity: 0.7636 0.1280 0.1900 0.0722 0.0882 2.7434 1.8693 5.3830 0.9021 11.0287 1.7097 0.3805 4.4417 0.8079 2.5016 13.9043 3.6185 13.0512 4.6982 0.6744 0.2977 2.2510 6.1840 9.7147 10.0613 1.1317 1.4398 3.2174 6.0758 11.5197 10.2663 7.3646 22.4172 30.8362 9.4672 30.0076 29.0531 6.0789 1.7293 59.4720 14.2231 51.3216 22.1178 134.0263 2.9204 29.3187 76.4801 7.3762 9.0760 24.9599 28.2184 10.5250 1.9269 9.4098 5.1718 0.3022 13.8267 6.1405 317.4526 17.4976 62.1315 48.8548 37.1083 9.9488 6.6526 2.3179 18.0904 58.8112 3.4847 2.7981 7.1717 8.2989 96.6776 22.8573 21.6610 17.9785 3.6721 3.4856 12.5948 10.1836 13.9859 2.2630 178.2712 14.1633 79.8452 19.2989 56.1537 2.6529 5.7121 4.6441 25.5548 27.6444 8.6582 6.6181 9.1978 21.8008 18.4132 4.7730 9.0103 11.2118 14.0512 28.0072
temp: 298.150 k
press: 1.00000 atm
elementType: 8 8 8 8 6 6 6 6 6 6 6 6 6 6 6 6 6 6 1 1 1 1 1 1 1 1 1 1 1 1 1 1 1 1 1 1
symmnumber: 1
zpe: 759407.9 jmol-1
zpe.correction: 0.289243 hartree
zpe.thermalcorrener: 0.309313 hartree
zpe.thermalcorrenthalpy: 0.310257 hartree
zpe.thermalcorrgfe: 0.238053 hartree
zpe.sumelectzpe: -843.769550 hartree
zpe.sumelectthermal: -843.749481 hartree
zpe.sumelectthermalent: -843.748536 hartree
zpe.sumelectthermalfe: -843.820740 hartree
dipole: -0.4728 -0.8026 0.7364
dipole: 1.1874
quadrupole: -98.2270 -107.9334 -98.5503
quadrupole: -6.5422 -4.8353 2.5349
quadrupole: 3.3433 -6.3631 3.0199 -6.5422 -4.8353 2.5349
hfenergy: -844.0587936 hartree
pointgroup: C01 [X(C14H18O4)]
dipole: -0.1992764 0.1092907 -0.4081608 debye
polarizability: 207.2039725|2.2596849|130.9168752|8.5274328|17.3299614|154.7628927 unknown
InChI: InChI=1S/C14H18O4/c1-5-7-12(18-10(2)15)11-8-6-9-13(16-3)14(11)17-4/h5-6,8-9,12H,1,7H2,2-4H3
charge 0 multiplicity 1
36 atoms
O  -2.129453 -0.655782 0.019563
O  1.347032 1.107857 1.178116
O  3.855786 0.116178 0.110469
O  -1.210025 -1.296257 2.068674
C  -1.151936 0.487713 -0.07115
C  0.164399 -0.013866 -0.641624
C  -1.842164 1.549051 -0.955016
C  1.38156 0.303328 0.014028
C  0.195922 -0.80224 -1.819024
C  2.621657 -0.150127 -0.523781
C  1.421024 -1.281626 -2.32857
C  2.634665 -0.950965 -1.684934
C  -3.07474 2.147458 -0.311171
C  -2.03258 -1.480615 1.141322
C  -4.305576 2.197211 -0.876816
C  1.688969 0.371705 2.430153
C  -3.037116 -2.609181 1.055471
C  4.21659 1.548637 0.227388
H  -0.981274 0.879014 0.946761
H  -1.090255 2.344774 -1.134325
H  -2.089983 1.10951 -1.938843
H  -0.74759 -1.064532 -2.309765
H  1.436239 -1.904945 -3.228963
H  3.601081 -1.297172 -2.065029
H  -2.925567 2.58315 0.690007
H  -5.154832 2.663679 -0.3648
H  -4.49937 1.76997 -1.868608
H  2.694878 -0.077318 2.346762
H  0.922285 -0.399587 2.616353
H  1.671814 1.132645 3.225587
H  -2.654978 -3.388701 0.371133
H  -3.995214 -2.247318 0.64947
H  -3.182539 -3.05375 2.050993
H  5.166405 1.563647 0.783259
H  3.436924 2.10989 0.771441
H  4.363258 1.984867 -0.779234
