program: Gaussian 09
title: 000221909
version: EM64L-G09RevD.01
frameworkgroup: C1[X(C11H20O4)]
method: RPBEPBE
basis: SDD
operation: Freq
keyword: #pfreq=noraman
keyword: PBEPBE/SDD
title: #p freq=noraman PBEPBE/SDD
converged: YES YES NO NO
title: Mulliken charges:
elementType: O O O O C C C C C C C C C C C H H H H H H H H H H H H H H H H H H H H
charge: -0.271626 -0.251173 -0.265155 -0.243362 0.280357 0.381276 -0.369521 -0.374635 -0.729965 -0.716336 -0.562341 -0.722146 0.292421 -0.262620 -0.667068 0.184963 0.227184 0.228179 0.181286 0.220364 0.219473 0.206301 0.198271 0.304713 0.194938 0.235489 0.243344 0.219099 0.238374 0.235766 0.220958 0.233108 0.214217 0.251607 0.224259
chargesum: 0.00000
title: Mulliken charges with hydrogens summed into heavy atoms:
elementType: O O O O C C C C C C C C C C C
charge: -0.271626 -0.251173 -0.265155 -0.243362 0.280357 0.381276 0.042626 0.034830 -0.083828 -0.018414 -0.083508 -0.028907 0.292421 0.191447 0.023015
polarizability: 1.52862310e+02 1.28513265e+00 1.27596387e+02 4.35153868e+00 8.20435028e-01 1.10900785e+02
1716.lowfreq: -16.2719 -6.9318 -0.0004 0.0003 0.0007 10.7538 20.0587 41.2245 44.4180
frequency: 18.9457 40.7889 44.2317 87.3760 108.6626 140.8796 165.6868 188.5161 196.1797 206.6718 221.6516 232.3671 241.1732 276.2772 281.6970 300.5447 340.8905 355.8009 394.6367 402.2135 405.6655 424.2340 462.6747 485.5428 516.6696 582.5421 642.3500 688.6986 718.2441 744.2927 771.5270 792.2419 814.1432 884.6751 895.8736 919.7139 930.1319 934.9630 946.1448 947.1907 963.8309 997.8554 1020.6497 1022.6807 1039.1487 1063.4353 1093.7337 1097.6557 1148.9151 1156.8235 1173.4542 1200.9925 1206.0404 1232.3610 1248.1302 1275.6631 1277.4738 1307.4623 1332.1033 1333.5032 1357.3184 1359.5545 1374.1495 1380.9921 1386.4483 1403.0843 1433.2341 1452.6139 1455.4710 1455.7673 1462.7546 1465.1599 1467.6451 1477.3943 1480.6793 1481.9688 1484.9514 1495.6019 1650.9960 2935.3393 2945.6620 2965.7223 2974.5521 2991.2696 2998.8366 3027.0065 3038.6708 3058.0383 3060.0780 3065.4338 3070.8601 3071.4074 3085.4897 3091.7195 3097.3055 3097.6577 3101.5287 3114.6806 3117.4810
redmass: 3.7758 3.4088 3.0610 4.5933 3.9116 4.0026 2.6569 1.0199 1.4167 1.1932 1.3628 2.1908 2.4431 2.4678 2.3199 2.5655 2.4368 3.0870 2.4311 1.8478 2.0698 3.4052 4.4183 5.2439 3.9864 4.3909 4.5009 4.4188 4.0370 3.2677 3.4678 2.0508 1.7968 2.6800 1.9292 2.1535 2.0032 1.5698 1.7718 1.4524 4.3086 2.8412 1.4453 3.0865 2.4554 1.8773 2.5405 2.7676 3.7559 1.6981 1.8908 2.1968 1.3148 1.5913 2.2714 2.1853 1.1187 1.7457 1.3996 1.3117 1.3543 1.3738 1.2175 1.1993 1.2337 1.2033 1.0914 1.0699 1.0745 1.0917 1.0436 1.0539 1.0502 1.0557 1.0716 1.0576 1.0517 1.0583 9.4355 1.0675 1.0669 1.0360 1.0374 1.0360 1.0352 1.0593 1.0601 1.0986 1.0988 1.0976 1.0964 1.0966 1.0976 1.1031 1.0992 1.0990 1.1008 1.1014 1.1054
irintensity: 2.0702 0.7818 0.2933 3.4157 0.7030 0.6903 0.6399 0.0081 0.3683 1.7884 0.5379 2.6819 3.1704 1.8648 1.3597 12.3971 0.4172 9.5711 0.0994 1.4824 1.2498 3.9727 8.9865 5.0020 12.8547 7.5211 5.8740 0.8019 10.6340 38.3348 3.7898 5.8480 2.0242 9.5059 14.4853 3.9733 27.4172 4.8724 11.9673 7.1226 11.1961 56.9547 2.3990 100.4220 72.5771 34.2488 85.9753 34.9005 315.3296 33.2051 17.8432 14.6435 2.0131 23.6329 16.7999 0.7366 3.5106 0.8502 50.8948 28.0728 5.3109 28.1593 23.3053 23.2728 21.6483 20.8467 16.4363 9.5857 1.5355 10.7292 13.8302 0.4176 5.1723 2.0611 16.7202 10.1110 12.7265 19.3253 163.5723 41.6295 88.3862 45.1608 43.7085 23.8956 17.6835 27.2784 6.0326 26.2383 3.0071 0.2473 85.4736 41.5230 34.7076 2.2911 22.3831 7.2729 12.2403 7.0061 37.5619
temp: 298.150 k
press: 1.00000 atm
elementType: 8 8 8 8 6 6 6 6 6 6 6 6 6 6 6 1 1 1 1 1 1 1 1 1 1 1 1 1 1 1 1 1 1 1 1
symmnumber: 1
zpe: 779840.5 jmol-1
zpe.correction: 0.297026 hartree
zpe.thermalcorrener: 0.314172 hartree
zpe.thermalcorrenthalpy: 0.315116 hartree
zpe.thermalcorrgfe: 0.251907 hartree
zpe.sumelectzpe: -730.835825 hartree
zpe.sumelectthermal: -730.818679 hartree
zpe.sumelectthermalent: -730.817735 hartree
zpe.sumelectthermalfe: -730.880944 hartree
dipole: -1.4062 0.8673 1.6501
dipole: 2.3350
quadrupole: -76.3441 -87.4444 -94.9002
quadrupole: -1.3781 0.6725 -3.2063
quadrupole: 9.8855 -1.2149 -8.6706 -1.3781 0.6725 -3.2063
hfenergy: -731.1328508 hartree
pointgroup: C01 [X(C11H20O4)]
dipole: -0.6412445 -0.0220648 -0.657485 debye
polarizability: 151.0355348|2.4375753|123.5362039|-9.2297896|6.8798264|116.7877426 unknown
InChI: InChI=1S/C11H20O4/c1-5-13-9(12)6-11(4)14-7-10(2,3)8-15-11/h5-8H2,1-4H3
charge 0 multiplicity 1
35 atoms
O  -0.673749 0.324711 -1.149551
O  -1.045005 -1.129322 0.770498
O  2.672289 0.166727 -1.184243
O  1.742664 0.459624 0.934796
C  -2.456743 0.928611 0.507107
C  -0.569399 -1.046773 -0.6219
C  -2.008284 0.931376 -0.977432
C  -2.384323 -0.545618 0.98282
C  -3.920523 1.420197 0.59395
C  -1.521579 1.815442 1.36314
C  0.942243 -1.35996 -0.560667
C  -1.316989 -2.052364 -1.523383
C  1.783365 -0.159325 -0.150511
C  3.570053 1.335809 -0.940354
C  4.832138 0.90961 -0.183969
H  -2.756309 0.399102 -1.605678
H  -1.893744 1.959385 -1.360722
H  -2.544461 -0.622727 2.071522
H  -3.160166 -1.153237 0.46594
H  -4.280131 1.393191 1.639643
H  -4.004244 2.465284 0.241178
H  -4.602949 0.798066 -0.017408
H  -1.857519 1.825388 2.417507
H  -0.485584 1.438237 1.33544
H  -1.52799 2.858897 0.994722
H  1.290069 -1.714936 -1.542749
H  1.075586 -2.162741 0.185221
H  -2.409087 -1.89928 -1.498148
H  -0.975875 -1.94168 -2.566725
H  -1.110018 -3.081899 -1.183777
H  3.798637 1.701831 -1.954304
H  3.004713 2.099451 -0.377611
H  5.523973 1.76821 -0.096972
H  4.57955 0.56541 0.832684
H  5.35569 0.097704 -0.718166
