program: Gaussian 09
title: 000221908
version: EM64L-G09RevD.01
frameworkgroup: C1[X(C11H20O2)]
method: RPBEPBE
basis: SDD
operation: Freq
keyword: #pfreq=noraman
keyword: PBEPBE/SDD
title: #p freq=noraman PBEPBE/SDD
converged: YES YES NO NO
title: Mulliken charges:
elementType: O O C C C C C C C C C C C H H H H H H H H H H H H H H H H H H H H
charge: -0.294558 -0.302756 0.357087 -0.470459 -0.461711 0.010824 -0.415152 -0.414083 -0.069190 -0.053610 -0.745420 -0.703733 -0.706195 0.216393 0.207160 0.206881 0.208907 0.191370 0.192210 0.213395 0.215073 0.193146 0.222701 0.221403 0.211297 0.212338 0.212455 0.235626 0.208066 0.227882 0.208473 0.229657 0.234523
chargesum: 0.00000
title: Mulliken charges with hydrogens summed into heavy atoms:
elementType: O O C C C C C C C C C C C
charge: -0.294558 -0.302756 0.357087 -0.046905 -0.045922 0.202194 -0.009546 -0.005864 0.153511 0.167793 -0.109330 -0.032159 -0.033542
polarizability: 1.46128502e+02 -2.29176375e-02 1.15157375e+02 1.94229710e+00 4.59795883e-01 1.01833708e+02
1716.lowfreq: -21.0165 -7.6983 -0.0007 -0.0002 0.0003 9.8106 62.2520 75.5349 82.7446
frequency: 62.1184 75.4850 82.6889 165.7306 195.0419 206.1127 208.5754 219.3005 222.6487 248.2959 284.6618 305.0872 335.1263 350.3571 398.6396 432.1196 463.9178 467.9867 495.6666 543.4175 629.0302 698.3552 711.5782 766.9867 773.0665 786.9521 834.2080 865.4345 876.7965 896.1619 930.4100 940.8482 963.8244 991.4757 1012.1811 1013.5080 1018.5821 1054.0104 1062.3955 1080.9922 1090.5879 1094.8250 1114.9902 1141.0342 1144.1574 1158.0468 1187.1803 1245.7720 1257.3896 1260.1249 1270.5748 1280.5130 1298.3936 1304.3751 1319.1978 1324.8352 1336.4101 1339.0688 1358.0882 1362.7196 1379.2225 1381.9887 1386.6821 1444.8413 1456.7281 1458.1306 1460.5481 1465.2249 1470.4721 1472.9294 1475.5956 1476.2491 1476.9247 2939.1919 2964.5825 2975.2194 2979.8835 2981.7726 2983.0228 2991.1294 2997.2663 3025.9094 3029.0450 3033.2188 3039.0427 3060.0899 3061.8308 3063.7597 3067.9089 3076.7071 3079.7873 3097.4705 3099.8995
redmass: 3.4030 3.6394 2.7879 2.3248 2.5073 1.2564 1.1559 1.2542 1.5387 2.1446 2.3281 3.4795 3.2412 2.5914 2.0560 2.0187 3.4974 3.0792 3.3023 2.9538 2.9937 3.3165 8.2560 2.2961 1.5866 2.2077 2.4773 3.0652 2.8229 1.8675 1.4265 1.6807 1.6683 1.3501 1.7123 2.6746 1.9230 2.9009 2.1644 1.3350 2.3080 2.3722 1.7422 1.7056 2.2770 2.3620 2.2145 1.4376 1.3405 1.5746 1.4497 1.3764 1.3803 1.2749 1.2580 1.5084 1.5549 1.4935 1.4790 1.5688 1.2273 1.2270 1.2204 1.0857 1.0850 1.0803 1.0479 1.0664 1.0718 1.0491 1.0517 1.0621 1.0583 1.0828 1.0364 1.0590 1.0595 1.0363 1.0366 1.0634 1.0641 1.0872 1.0872 1.1008 1.1004 1.0992 1.1004 1.0992 1.1007 1.0976 1.0973 1.1007 1.1003
irintensity: 1.4368 2.2394 0.3538 0.2942 0.9895 0.1153 0.1619 0.7479 1.1865 1.7222 0.0270 1.3960 0.3377 2.4799 2.7238 1.2858 12.9102 3.2997 0.5613 4.6948 5.0860 0.7050 3.9654 3.6764 0.8861 9.0989 12.1417 18.0216 27.6224 4.5260 6.7748 0.8081 7.6880 15.4213 27.3279 66.5194 71.0966 48.6042 41.6401 1.5653 3.4961 7.4435 71.9058 11.8240 4.5173 20.5345 5.6856 15.8100 15.2113 8.4220 0.8416 0.7245 0.6683 11.6380 5.2788 3.6425 6.2712 0.5756 10.0500 21.0097 26.8179 17.9263 9.4557 9.4048 5.3189 6.2277 23.7439 4.6295 6.5142 14.6588 10.0576 7.7147 9.4915 22.6467 31.2394 41.0706 59.9686 20.4094 16.9402 15.1397 20.5643 26.3907 24.2697 43.0020 23.2384 34.8289 34.6849 44.5391 100.4656 13.4061 53.4400 10.9801 41.8844
temp: 298.150 k
press: 1.00000 atm
elementType: 8 8 6 6 6 6 6 6 6 6 6 6 6 1 1 1 1 1 1 1 1 1 1 1 1 1 1 1 1 1 1 1 1
symmnumber: 1
zpe: 765073.7 jmol-1
zpe.correction: 0.291401 hartree
zpe.thermalcorrener: 0.305141 hartree
zpe.thermalcorrenthalpy: 0.306085 hartree
zpe.thermalcorrgfe: 0.252184 hartree
zpe.sumelectzpe: -580.558801 hartree
zpe.sumelectthermal: -580.545061 hartree
zpe.sumelectthermalent: -580.544117 hartree
zpe.sumelectthermalfe: -580.598018 hartree
dipole: -1.0223 0.1823 -0.4419
dipole: 1.1286
quadrupole: -73.2191 -79.3380 -84.2853
quadrupole: -1.5361 3.9774 1.1029
quadrupole: 5.7284 -0.3905 -5.3378 -1.5361 3.9774 1.1029
hfenergy: -580.8502019 hartree
pointgroup: C01 [X(C11H20O2)]
dipole: 0.4020859 -0.1632894 -0.093876 debye
polarizability: 146.1395407|-1.3501639|110.1010731|-1.1894582|-6.4896644|106.8789721 unknown
InChI: InChI=1S/C11H20O2/c1-8-4-6-11(7-5-8)12-9(2)10(3)13-11/h8-10H,4-7H2,1-3H3
charge 0 multiplicity 1
33 atoms
O  1.441727 1.008879 0.747406
O  0.68846 -0.880467 -0.469677
C  0.216042 0.333157 0.254299
C  -0.651369 -0.046014 1.467673
C  -0.555694 1.219095 -0.740509
C  -2.775395 0.197545 0.039524
C  -1.982523 -0.698625 1.025863
C  -1.881275 0.551843 -1.176643
C  2.625653 0.384997 0.099177
C  2.140233 -1.059692 -0.20032
C  -4.090321 -0.477988 -0.403381
C  3.082244 1.162391 -1.144399
C  2.396522 -2.055105 0.941283
H  -0.848472 0.880063 2.042657
H  -0.076485 -0.72544 2.121681
H  0.087216 1.426435 -1.614197
H  -0.762517 2.184797 -0.238824
H  -3.026778 1.145547 0.565594
H  -2.600706 -0.922366 1.917223
H  -1.760817 -1.665363 0.530343
H  -1.649359 -0.376239 -1.73634
H  -2.427441 1.223727 -1.867297
H  3.414709 0.39381 0.872872
H  2.563558 -1.440969 -1.147568
H  -3.881632 -1.427134 -0.934059
H  -4.735771 -0.711771 0.464251
H  -4.665959 0.171795 -1.089258
H  3.199811 2.232681 -0.90238
H  4.056024 0.778504 -1.503926
H  2.348401 1.065935 -1.963714
H  3.4734 -2.303195 1.001457
H  2.083833 -1.635362 1.913588
H  1.835879 -2.989275 0.764997
