program: Gaussian 09
title: 000221907
version: EM64L-G09RevD.01
frameworkgroup: C1[X(C12H18O2)]
method: RPBEPBE
basis: SDD
operation: Freq
keyword: #pfreq=noraman
keyword: PBEPBE/SDD
title: #p freq=noraman PBEPBE/SDD
converged: YES YES NO NO
title: Mulliken charges:
elementType: O O C C C C C C C C C C C C H H H H H H H H H H H H H H H H H H
charge: -0.296882 -0.263167 -0.121041 0.252315 0.305185 -0.369046 -0.410255 -0.840657 -0.209247 -0.223022 -0.244484 -0.232650 -0.684056 -0.681909 0.199974 0.279787 0.230483 0.222718 0.227132 0.264383 0.217155 0.191116 0.211877 0.213346 0.225688 0.224496 0.206184 0.228468 0.225125 0.205027 0.224573 0.221384
chargesum: 0.00000
title: Mulliken charges with hydrogens summed into heavy atoms:
elementType: O O C C C C C C C C C C C C
charge: -0.296882 -0.263167 0.078933 0.252315 0.305185 -0.089259 -0.179772 -0.126425 0.199024 0.202201 -0.018797 -0.008153 -0.024279 -0.030924
polarizability: 1.63325930e+02 -3.11444652e-01 1.23837631e+02 4.16088894e+00 1.85270185e+01 1.17572495e+02
1716.lowfreq: -9.8038 -7.7531 -2.8522 -0.0008 -0.0007 -0.0005 38.9415 40.7110 55.2649
frequency: 38.8349 40.6777 55.2447 73.2197 77.1379 103.9175 124.7444 150.9775 184.9626 224.8474 235.6322 243.3487 252.0299 287.0591 300.8003 350.6965 401.2778 438.8084 476.2751 510.2292 550.0555 605.0847 668.1866 725.7102 750.7686 782.2381 791.2238 810.5890 812.6657 847.3958 875.1136 887.5975 919.3312 962.4182 989.1490 993.4835 997.4194 1029.2426 1046.2300 1049.3018 1054.7034 1106.9220 1111.9205 1116.7428 1137.4465 1138.8042 1172.9250 1186.2828 1229.8341 1244.8897 1246.6942 1284.8214 1308.0409 1316.6330 1359.5586 1368.9897 1383.1579 1392.7950 1397.0254 1398.5021 1434.7793 1460.2359 1460.9245 1465.1885 1478.6098 1479.7776 1481.5158 1487.9902 1492.8670 1496.1738 1588.2235 1615.8983 2946.6838 2968.2685 2969.5448 2971.2200 2989.7505 2992.5744 3020.8537 3025.4850 3054.0301 3087.4593 3089.6239 3090.8958 3095.4558 3099.7984 3117.4719 3132.3831 3152.2284 3172.0769
redmass: 2.7096 2.9799 2.6608 2.5646 1.9612 3.4449 1.0470 3.1249 2.8375 2.2603 3.0905 1.4317 1.3294 4.4850 3.5029 3.7418 3.2764 3.1046 3.4720 4.0252 4.8926 5.6718 4.7785 3.7533 1.4203 4.0706 2.5224 1.1013 1.0999 3.2393 1.7894 2.0153 4.5647 1.4482 1.5721 1.4046 3.1209 2.7543 2.0069 1.6813 3.9165 1.9825 2.0392 2.2421 1.4432 1.4548 1.0657 1.8798 2.5189 1.1671 1.1575 1.4957 1.4100 1.1685 1.2848 1.8648 2.4292 1.2621 1.2924 1.2995 2.1686 1.0414 1.0410 1.0691 1.0691 1.9978 1.0581 1.2237 1.0815 1.0847 6.5089 6.3093 1.0618 1.0573 1.0715 1.0509 1.0360 1.0360 1.1006 1.1063 1.0922 1.0989 1.0989 1.1001 1.1013 1.1012 1.0861 1.0901 1.0964 1.0965
irintensity: 0.0364 0.0182 0.1323 1.8699 1.9920 0.6937 0.3445 7.7235 2.8247 1.7242 2.9887 0.3249 2.6203 0.6680 4.3844 16.5202 1.0782 3.9100 1.4411 1.5072 2.1509 6.1362 4.3275 1.5174 88.7510 3.1821 12.0812 3.6533 2.8896 0.3736 6.3172 21.5605 194.1332 6.2316 7.3166 4.1121 58.3053 71.3120 16.4317 16.1203 174.1440 2.9127 6.1761 4.7999 4.7035 7.9532 2.5187 3.5446 13.1640 2.0202 0.6640 26.0791 40.3127 2.5521 1.5369 0.4234 5.7792 22.3771 37.2693 4.5632 5.0587 10.1667 11.1994 9.1468 8.7250 17.7695 5.0738 18.6214 8.8358 0.9385 1.8185 3.1534 50.7181 42.7872 8.4359 61.3446 28.8632 25.4563 24.0321 28.1924 20.6970 31.5334 37.8614 11.4783 43.6164 40.8868 5.3352 20.6030 31.1039 12.3417
temp: 298.150 k
press: 1.00000 atm
elementType: 8 8 6 6 6 6 6 6 6 6 6 6 6 6 1 1 1 1 1 1 1 1 1 1 1 1 1 1 1 1 1 1
symmnumber: 1
zpe: 714999.6 jmol-1
zpe.correction: 0.272329 hartree
zpe.thermalcorrener: 0.288005 hartree
zpe.thermalcorrenthalpy: 0.288949 hartree
zpe.thermalcorrgfe: 0.228335 hartree
zpe.sumelectzpe: -617.419799 hartree
zpe.sumelectthermal: -617.404124 hartree
zpe.sumelectthermalent: -617.403179 hartree
zpe.sumelectthermalfe: -617.463794 hartree
dipole: 0.5966 0.2469 -0.0144
dipole: 0.6458
quadrupole: -76.0904 -86.3424 -81.1827
quadrupole: -2.5403 0.4230 0.2959
quadrupole: 5.1148 -5.1372 0.0224 -2.5403 0.4230 0.2959
hfenergy: -617.6921284 hartree
pointgroup: C01 [X(C12H18O2)]
dipole: -0.2285771 -0.1107658 0.0062561 debye
polarizability: 163.3505502|4.6953589|108.528525|1.6540184|-14.0240149|132.8569814 unknown
InChI: InChI=1S/C12H18O2/c1-4-13-12(14-5-2)11-9-7-6-8-10(11)3/h6-9,12H,4-5H2,1-3H3
charge 0 multiplicity 1
32 atoms
O  -1.633982 0.84658 -0.370933
O  -1.132433 -1.174917 0.860447
C  -0.786509 0.246959 0.641942
C  0.670502 0.459772 0.249245
C  1.69896 0.208204 1.20701
C  1.006491 0.886817 -1.057465
C  3.047547 0.390662 0.809681
C  1.377329 -0.232973 2.626133
C  -3.05713 0.918568 0.025809
C  -0.847822 -2.063704 -0.291191
C  2.355394 1.063523 -1.435298
C  3.381453 0.812647 -0.497151
C  -3.821673 1.548277 -1.136845
C  -1.470292 -3.421045 0.034695
H  -1.010271 0.682555 1.638415
H  0.195227 1.089371 -1.762104
H  3.844684 0.20009 1.538578
H  2.293089 -0.53738 3.161049
H  0.911515 0.587244 3.207901
H  0.665271 -1.076576 2.632521
H  -3.425247 -0.100193 0.255882
H  -3.144237 1.536078 0.94625
H  -1.286365 -1.624425 -1.209177
H  0.2483 -2.145671 -0.43426
H  2.602084 1.395927 -2.449857
H  4.432577 0.946181 -0.777683
H  -4.894578 1.637706 -0.886159
H  -3.429302 2.555053 -1.361799
H  -3.726467 0.928612 -2.045443
H  -1.279836 -4.136828 -0.786118
H  -1.040134 -3.834019 0.963968
H  -2.561847 -3.328099 0.172358
