program: Gaussian 09
title: 000221904
version: EM64L-G09RevD.01
frameworkgroup: C1[X(C11H14O2)]
method: RPBEPBE
basis: SDD
operation: Freq
keyword: #pfreq=noraman
keyword: PBEPBE/SDD
title: #p freq=noraman PBEPBE/SDD
converged: YES YES NO NO
title: Mulliken charges:
elementType: O O C C C C C C C C C C C H H H H H H H H H H H H H H
charge: -0.273619 -0.285875 0.328016 -0.587523 -0.325303 -0.323190 -0.704690 0.477873 -0.443444 -0.382447 -0.223457 -0.227906 -0.247364 0.224349 0.240960 0.230688 0.208903 0.209573 0.231616 0.228263 0.216077 0.251564 0.229838 0.275097 0.223190 0.222911 0.225901
chargesum: 0.00000
title: Mulliken charges with hydrogens summed into heavy atoms:
elementType: O O C C C C C C C C C C C
charge: -0.273619 -0.285875 0.328016 -0.122214 0.114287 0.117999 -0.008787 0.477873 -0.213605 -0.107350 -0.000267 -0.004995 -0.021463
polarizability: 1.58161043e+02 2.28390958e+00 1.17586351e+02 -1.10166803e+01 9.63248776e-01 7.81270242e+01
1716.lowfreq: -12.1145 -9.6945 -1.2203 -0.0010 -0.0006 0.0003 12.8048 26.8729 59.6824
frequency: 10.1292 25.3950 59.3063 88.1438 145.6224 215.4301 228.7400 247.2468 275.3499 345.8432 377.1262 404.3608 449.8411 500.0673 579.0574 616.1440 655.8348 689.9402 705.2948 733.8633 748.0755 780.6257 825.8132 829.4602 857.2874 901.4549 919.4492 925.1127 937.4636 974.0606 979.2497 987.3388 991.0082 996.1620 1028.4760 1056.8670 1087.8099 1098.7165 1107.9853 1166.4848 1170.8939 1184.0090 1189.8844 1211.7005 1238.2890 1258.4183 1309.8808 1311.0156 1323.7142 1342.2749 1381.3559 1383.0756 1439.0895 1449.4051 1460.0357 1466.2242 1484.7062 1485.5849 1496.3497 1591.3900 1614.7578 2983.4256 2994.7233 2999.9273 3007.6403 3068.0124 3068.7676 3089.7431 3093.3397 3106.8379 3114.5774 3123.7558 3137.4559 3151.5333 3163.1468
redmass: 1.8591 3.7351 3.8815 4.3343 3.5376 1.3061 2.8938 2.9526 4.8931 2.0619 2.9007 2.8331 2.8917 3.8105 5.3803 6.0984 4.0425 5.9553 1.8785 5.5044 1.9028 3.3263 2.9385 1.2235 1.2475 2.1918 2.3230 1.6574 2.0908 7.6633 1.4016 4.3895 5.4965 1.3536 2.2038 1.6284 1.6659 2.0911 1.5966 1.1272 1.0550 1.1247 1.1236 2.4430 1.7914 2.2869 1.4735 1.2695 1.3267 1.4345 6.3522 1.2619 1.8152 1.2085 1.0596 1.0632 2.2810 1.0859 1.0849 6.0454 6.0659 1.0645 1.0413 1.0589 1.0600 1.1001 1.1011 1.1018 1.1014 1.0998 1.0863 1.0870 1.0927 1.0955 1.1009
irintensity: 1.5366 0.3553 0.7616 1.3126 7.8298 0.6363 3.1919 2.7518 1.2293 2.5427 2.0230 0.1918 1.4400 27.6461 7.0035 0.8635 10.5599 0.8315 51.0385 8.4573 59.5891 18.0157 7.1484 1.4429 0.3176 18.4469 26.4844 9.5174 10.1899 12.8625 0.3077 55.6651 10.2845 3.7309 6.3766 9.4710 34.4526 87.9860 6.8168 7.2603 0.2244 0.2949 0.3557 5.9093 54.9222 25.2511 12.8999 1.2972 1.1703 12.8629 0.0940 36.3844 4.2826 8.0168 17.4771 4.1466 23.1285 0.5975 3.5473 0.7744 9.3102 30.7089 15.4135 115.4622 13.3639 5.0322 7.2172 61.0201 29.3874 14.7000 8.0024 1.6498 32.5609 24.3990 19.9178
temp: 298.150 k
press: 1.00000 atm
elementType: 8 8 6 6 6 6 6 6 6 6 6 6 6 1 1 1 1 1 1 1 1 1 1 1 1 1 1
symmnumber: 1
zpe: 588841.3 jmol-1
zpe.correction: 0.224278 hartree
zpe.thermalcorrener: 0.236549 hartree
zpe.thermalcorrenthalpy: 0.237493 hartree
zpe.thermalcorrgfe: 0.183055 hartree
zpe.sumelectzpe: -577.018298 hartree
zpe.sumelectthermal: -577.006026 hartree
zpe.sumelectthermalent: -577.005082 hartree
zpe.sumelectthermalfe: -577.059521 hartree
dipole: 1.5874 0.5195 1.1998
dipole: 2.0565
quadrupole: -64.4336 -75.2852 -79.5284
quadrupole: 5.4168 0.4635 -0.7149
quadrupole: 8.6488 -2.2028 -6.4460 5.4168 0.4635 -0.7149
hfenergy: -577.2425753 hartree
pointgroup: C01 [X(C11H14O2)]
dipole: 0.631395 0.0688892 0.5012407 debye
polarizability: 156.873279|8.800707|113.2776849|-11.7891009|12.5851693|83.7234541 unknown
InChI: InChI=1S/C11H14O2/c1-11(12-7-8-13-11)9-10-5-3-2-4-6-10/h2-6H,7-9H2,1H3
charge 0 multiplicity 1
27 atoms
O  2.661929 -0.673581 -0.839583
O  1.616015 1.158792 0.160492
C  1.42694 -0.287231 -0.115016
C  0.267366 -0.454856 -1.113115
C  3.759945 0.14457 -0.283353
C  3.05844 1.353197 0.416136
C  1.284693 -1.08392 1.190152
C  -1.127971 -0.227331 -0.545437
C  -2.105395 -1.252423 -0.613399
C  -1.489276 1.016891 0.037688
C  -3.413123 -1.045837 -0.116026
C  -2.793911 1.225069 0.536657
C  -3.762336 0.195758 0.461574
H  0.346584 -1.476548 -1.526558
H  0.473649 0.249301 -1.940308
H  4.39501 0.44208 -1.133525
H  4.358937 -0.448421 0.43433
H  3.261269 1.3682 1.504456
H  3.327387 2.328215 -0.020647
H  1.178544 -2.159063 0.96411
H  2.172098 -0.950292 1.833948
H  0.392732 -0.74904 1.744925
H  -1.842015 -2.217967 -1.063334
H  -0.737141 1.810293 0.102387
H  -4.155267 -1.849906 -0.180681
H  -3.057098 2.191161 0.982998
H  -4.775205 0.360391 0.846428
