program: Gaussian 09
title: 000221900
version: EM64L-G09RevD.01
frameworkgroup: C1[X(C11H13ClO2)]
method: RPBEPBE
basis: SDD
operation: Freq
keyword: #p
keyword: freq=noraman
keyword: PBEPBE/SDD
title: #p freq=noraman PBEPBE/SDD
converged: YES YES NO NO
title: Mulliken charges:
elementType: Cl O O C C C C C C C C C C C H H H H H H H H H H H H H
charge: -0.061638 -0.270711 -0.288968 -0.013981 -0.012629 -0.140425 -0.722652 -0.702442 0.361604 -0.371448 -0.357222 -0.197736 -0.205821 -0.103351 0.215802 0.212463 0.250340 0.230121 0.237828 0.213242 0.238368 0.212072 0.228384 0.272231 0.264940 0.255762 0.255867
chargesum: 0.00000
title: Mulliken charges with hydrogens summed into heavy atoms:
elementType: Cl O O C C C C C C C C C C C
charge: -0.061638 -0.270711 -0.288968 0.201821 0.199834 0.109915 -0.041461 -0.023618 0.361604 -0.099218 -0.092282 0.058025 0.050046 -0.103351
polarizability: 1.76950031e+02 1.39880254e+00 1.22720070e+02 1.02547993e+01 -1.72293061e+00 8.84786259e+01
1716.lowfreq: -8.2469 -0.0016 -0.0011 -0.0002 6.3058 11.7986 25.0590 37.7536 55.9801
frequency: 24.4221 37.6701 55.9669 98.7847 155.8527 197.2035 205.7819 224.7235 239.1115 282.7461 292.1063 320.2353 348.6683 408.7080 428.6463 468.8543 489.2912 525.4824 567.9709 622.6809 644.8742 699.6863 738.0568 784.2618 799.1994 811.9513 838.3222 852.1006 867.9318 899.0208 963.0606 977.5802 981.0511 998.2216 1014.0378 1049.8727 1068.8395 1069.6906 1104.1867 1115.6673 1143.5812 1169.2489 1177.8700 1204.2502 1238.1655 1275.8481 1289.4527 1294.5069 1304.2555 1323.3433 1369.0936 1372.4553 1387.6684 1392.1148 1394.5203 1460.0474 1461.0315 1471.3972 1475.0775 1478.2912 1586.1957 1598.2374 2962.9798 2987.6640 2989.8883 2994.0197 3026.8492 3082.9301 3090.5289 3099.3361 3101.9969 3148.8496 3155.3810 3171.0839 3175.5552
redmass: 3.7493 3.9585 4.1229 6.3727 4.9090 1.1362 1.0927 3.9267 3.2473 5.1414 6.4496 2.6173 3.5475 2.9424 6.2793 3.9262 3.4908 3.7403 5.4304 7.1400 5.6364 4.9325 6.4709 2.2538 2.3514 2.4411 1.2643 2.2929 2.5061 7.3748 1.4284 1.2425 1.3759 4.3220 3.4905 2.6926 1.7490 2.6507 1.3490 2.6539 2.2032 1.9794 1.1367 2.8665 1.2382 1.3077 1.2489 1.1960 1.2091 1.3558 1.6724 5.7230 3.4769 1.2553 1.2421 1.0477 1.0536 2.4204 1.0477 1.0489 7.8942 6.2456 1.0835 1.0405 1.0817 1.0371 1.0870 1.0984 1.0990 1.1004 1.1003 1.0886 1.0882 1.0963 1.0973
irintensity: 2.1390 0.3343 0.0646 2.3799 0.4759 0.0526 0.7665 2.0193 1.6350 0.4218 1.4084 1.0450 1.3728 0.1405 22.5716 0.9131 23.5277 12.2998 7.3718 1.0853 8.9812 4.1345 3.3083 12.1628 44.7726 18.3903 1.4789 10.7947 55.3670 62.0897 23.9777 14.9949 9.9245 91.7249 32.0199 140.1653 9.1778 26.0494 3.2346 7.7152 1.5977 0.5896 9.1111 39.7828 5.7234 3.3402 0.4959 50.3365 8.9886 1.6643 0.5703 0.6341 5.6631 26.8718 21.6614 13.5230 4.3455 59.6931 8.6311 12.0030 2.6721 22.7392 16.1638 25.0898 55.1912 29.8435 29.9754 31.9332 23.3393 15.0909 38.6660 1.3478 0.4881 6.0217 1.6729
temp: 298.150 k
press: 1.00000 atm
elementType: 17 8 8 6 6 6 6 6 6 6 6 6 6 6 1 1 1 1 1 1 1 1 1 1 1 1 1
symmnumber: 1
zpe: 562999.9 jmol-1
zpe.correction: 0.214435 hartree
zpe.thermalcorrener: 0.227961 hartree
zpe.thermalcorrenthalpy: 0.228905 hartree
zpe.thermalcorrgfe: 0.172626 hartree
zpe.sumelectzpe: -1036.414028 hartree
zpe.sumelectthermal: -1036.400503 hartree
zpe.sumelectthermalent: -1036.399558 hartree
zpe.sumelectthermalfe: -1036.455837 hartree
dipole: -2.7194 0.0923 1.3869
dipole: 3.0540
quadrupole: -92.0849 -86.2822 -90.5931
quadrupole: -1.1113 -6.5094 0.1565
quadrupole: -2.4315 3.3712 -0.9397 -1.1113 -6.5094 0.1565
hfenergy: -1036.6284637 hartree
pointgroup: C01 [X(C11H13Cl1O2)]
dipole: -1.1091552 0.0307153 0.4609922 debye
polarizability: 174.1538274|8.8871283|122.1330084|15.849477|-6.1302543|91.8618907 unknown
InChI: InChI=1S/C11H13ClO2/c1-7-8(2)14-11(13-7)9-3-5-10(12)6-4-9/h3-8,11H,1-2H3
charge 0 multiplicity 1
27 atoms
Cl 4.6604 0.692821 0.94412
O  -1.705425 -1.462186 -0.465921
O  -1.818331 0.742081 -1.300256
C  -2.425437 -0.656497 0.561872
C  -2.866651 0.597219 -0.240085
C  -0.976656 -0.472343 -1.263367
C  -3.555869 -1.504422 1.133051
C  -2.954045 1.889767 0.571622
C  0.405587 -0.163849 -0.685576
C  0.954598 1.137686 -0.774221
C  1.169623 -1.204192 -0.101876
C  2.250823 1.406849 -0.279225
C  2.465604 -0.951078 0.400243
C  2.984618 0.354374 0.300415
H  -1.703507 -0.357226 1.351629
H  -3.824988 0.388295 -0.756974
H  -0.913233 -0.884212 -2.286779
H  -4.238351 -1.829023 0.328279
H  -3.154168 -2.402644 1.631754
H  -4.133468 -0.927452 1.877949
H  -3.190012 2.743135 -0.086588
H  -3.753195 1.81473 1.332806
H  -1.996332 2.097747 1.08043
H  0.356625 1.939302 -1.218523
H  0.73975 -2.208421 -0.02603
H  2.678302 2.411751 -0.342468
H  3.056737 -1.749211 0.858618
