program: Gaussian 09
title: 000221897
version: EM64L-G09RevD.01
frameworkgroup: C1[X(C11H12O3)]
method: RPBEPBE
basis: SDD
operation: Freq
keyword: #pfreq=noraman
keyword: PBEPBE/SDD
title: #p freq=noraman PBEPBE/SDD
converged: YES YES NO NO
title: Mulliken charges:
elementType: O O O C C C C C C C C C C C H H H H H H H H H H H H
charge: -0.230106 -0.299042 -0.224461 0.250396 0.105144 -0.298746 -0.354591 -0.247591 -0.225714 -0.350493 0.172911 -0.061193 -0.501203 -0.555052 0.276465 0.249111 0.232655 0.228497 0.217776 0.216872 0.249170 0.241681 0.238361 0.227926 0.224531 0.216697
chargesum: 0.00000
title: Mulliken charges with hydrogens summed into heavy atoms:
elementType: O O O C C C C C C C C C C C
charge: -0.230106 -0.299042 -0.224461 0.250396 0.105144 -0.022281 -0.105480 -0.014936 0.002783 0.084155 0.172911 0.187976 0.206765 -0.113825
polarizability: 1.72669717e+02 -7.05007915e+00 1.57700877e+02 5.38243522e+00 2.18066135e+00 6.83837478e+01
1716.lowfreq: -0.0005 -0.0002 0.0008 5.9544 8.0969 11.0776 25.2846 49.5632 65.5414
frequency: 25.2647 49.5382 65.5264 89.6172 101.0495 114.5805 130.4260 163.2733 179.3487 252.5207 273.1623 280.5727 333.4507 366.9301 428.0475 448.8325 515.9958 533.3396 578.1628 628.6939 653.8021 677.9424 754.6364 760.3803 769.5637 801.6563 858.8644 908.9674 925.2908 953.1806 959.6704 966.2066 981.5861 989.3401 1012.1309 1033.7401 1049.9431 1113.2256 1132.6327 1143.5565 1147.8705 1177.4620 1215.7766 1221.7204 1229.0839 1280.2197 1282.9835 1342.8752 1384.6040 1421.5192 1429.0092 1433.7389 1450.1517 1463.4669 1465.6202 1483.4246 1582.6153 1601.1567 1635.8892 1667.5241 2942.7951 2999.6955 3016.1214 3092.7114 3098.7953 3132.8265 3134.1572 3141.8877 3156.9259 3173.0504 3185.2295 3203.6180
redmass: 6.1988 4.4303 3.0112 3.0130 1.4923 1.7374 2.8563 3.5870 4.1289 5.1618 4.6885 3.7965 4.7009 4.7644 3.5239 3.2877 3.4696 3.9904 3.6493 2.3348 4.0970 4.4839 5.8195 2.0337 2.0500 5.5826 1.5056 3.0437 2.9540 1.4186 1.3746 2.9023 1.5378 1.3380 1.2796 8.1278 2.2283 1.2653 1.8078 1.4432 1.6777 1.0769 1.5089 2.5426 3.1670 1.4806 1.2517 1.3557 6.5901 1.2240 1.7026 1.3865 1.0502 1.2389 1.0530 2.0052 7.1510 6.4452 9.9143 4.8067 1.0576 1.0296 1.1034 1.0616 1.1041 1.0945 1.0867 1.1044 1.0915 1.0941 1.0969 1.1140
irintensity: 2.1414 0.7110 0.4533 4.5941 0.8936 1.0494 1.7299 3.3156 1.8757 2.5535 4.7813 7.0919 8.7440 1.4724 1.6615 1.1609 2.6355 5.3223 12.2750 5.9084 10.5610 18.0103 6.2298 73.8592 17.6664 13.2536 0.3232 33.0122 2.7679 120.1484 12.5268 71.8793 5.0188 0.4980 16.9574 249.7995 15.6521 0.1558 35.9837 56.6126 2.7537 10.1290 38.8454 74.3931 344.9968 26.2735 4.6399 9.7011 7.4034 20.3077 65.1324 6.4357 13.0970 33.0041 10.1680 60.6970 46.5406 12.5275 262.2388 5.1699 37.4606 45.0022 30.7112 9.3575 29.6127 3.6269 4.8070 18.7268 20.3185 14.6126 7.4277 22.5852
temp: 298.150 k
press: 1.00000 atm
elementType: 8 8 8 6 6 6 6 6 6 6 6 6 6 6 1 1 1 1 1 1 1 1 1 1 1 1
symmnumber: 1
zpe: 533529.5 jmol-1
zpe.correction: 0.203211 hartree
zpe.thermalcorrener: 0.217360 hartree
zpe.thermalcorrenthalpy: 0.218304 hartree
zpe.thermalcorrgfe: 0.160511 hartree
zpe.sumelectzpe: -650.967939 hartree
zpe.sumelectthermal: -650.953790 hartree
zpe.sumelectthermalent: -650.952845 hartree
zpe.sumelectthermalfe: -651.010639 hartree
dipole: 0.6297 2.0478 0.2256
dipole: 2.1542
quadrupole: -64.7590 -73.8530 -84.7531
quadrupole: 5.6389 0.8710 -0.6231
quadrupole: 9.6960 0.6020 -10.2980 5.6389 0.8710 -0.6231
hfenergy: -651.1711498 hartree
pointgroup: C01 [X(C11H12O3)]
dipole: -0.1892931 0.8261195 0.0039261 debye
dipolederiv: -1.9445673 -0.2817123 0.0622701 0.0283168 -0.2063463 0.0121378 0.0992621 0.0158865 -0.2473534 -0.7281144 -0.5840673 0.2210718 -0.3554632 -1.3203803 0.2290077 0.2136502 0.3711452 -0.4185239 -0.746851 0.1126242 0.1687959 0.2216198 -0.7755491 -0.0389298 0.1523088 0.06061 -0.3684596 1.5396613 0.2262636 -0.0370992 -0.5565628 0.1167286 0.0241349 0.0435326 -0.0516065 0.1204615 -0.3550542 0.2547519 0.0016296 -0.093348 -0.6823626 0.0590895 0.0379168 0.0407041 -0.0658801 0.0596467 -0.299865 0.0255636 0.020164 0.2400558 -0.0398648 -0.0186664 0.0268338 -0.0995582 -0.3915861 -0.0142909 0.0016739 0.4839689 -0.0601238 -0.0280916 -0.0519731 -0.0033705 -0.2079043 -0.018636 -0.12371 -0.0046782 -0.1281125 -0.4299363 0.0305825 -0.0038926 0.0312094 -0.1985192 0.2778492 0.1899836 -0.038271 -0.0146267 0.1896504 -0.0338593 -0.0139695 -0.04511 -0.1149932 1.0400348 0.2360621 -0.0137163 0.5271531 0.3655122 -0.0676195 -0.1980229 -0.0495053 0.3925546 1.1412537 0.3092732 -0.4098089 0.1205146 1.9372541 -0.2088887 -0.3668737 -0.3813773 0.4259918 0.0639932 -0.045602 0.0663223 -0.1230392 0.0150098 0.1436891 0.0485064 0.1254478 -0.0807 0.233749 0.0181017 0.0102715 0.1298172 0.7266916 -0.0801936 -0.0086933 -0.0811209 0.2898859 -0.1669844 -0.1149202 0.0141588 -0.1030521 -0.0537779 0.2026416 0.0682978 0.2133066 -0.222538 0.0366566 -0.0822721 0.0135871 -0.0714206 0.0755274 0.0067957 0.0216959 0.0024964 0.1502594 -0.0045007 -0.1045135 0.0210558 -0.10738 0.0018093 0.0184944 0.01103 0.0190329 0.1643392 -0.1124443 0.0628574 0.0106677 0.0440476 0.0616577 0.0082083 0.0103069 0.0020544 0.1688905 0.0684237 0.051683 -0.0018835 0.0713449 -0.1063891 0.0240502 0.0003123 0.0250296 0.1493535 -0.1007535 0.0280059 -0.0871881 -0.1010744 -0.0097197 0.0803446 0.0137855 0.101966 -0.0932773 -0.0291675 -0.0069008 0.0149318 -0.0963087 -0.0811193 -0.0803621 0.0275043 -0.1120865 -0.04331 0.0871379 0.0007834 -0.0234126 0.0833697 0.0084738 -0.100539 -0.0444649 -0.1060033 0.077418 -0.0105275 0.0913456 -0.1287017 -0.0260082 -0.0257511 0.0253407 -0.0837866 0.034754 0.0074753 0.0996428 0.059859 0.0331879 -0.0262246 -0.0616087 -0.0172467 0.0109883 -0.1022673 -0.0970064 -0.0586176 -0.1191052 0.0827392 -0.05371 0.0135909 0.0329935 0.0743728 0.0552393 0.0831994 -0.0798093 0.0818342 -0.007164 0.1088853 0.0767822 -0.0554922 -0.0221581 -0.0598288 0.14736 0.099565 0.0535304 0.0039966 0.0171288 -0.0156798 -0.1464232 -0.0209698 -0.1334397 0.0808345 unknown
polarizability: 175.1209882|3.2212842|155.3082226|0.4138451|-5.0084817|68.3251307 unknown
InChI: InChI=1S/C11H12O3/c1-3-8-14-10-7-5-4-6-9(10)11(12)13-2/h3-7H,1,8H2,2H3
charge 0 multiplicity 1
26 atoms
O  1.293439 0.269932 -0.35274
O  -1.733495 -2.584064 0.371827
O  0.428866 -2.351542 -0.45506
C  -0.04293 0.657597 -0.350955
C  -1.027697 -0.373386 -0.193135
C  -2.397031 0.00002 -0.133975
C  -0.455178 2.01223 -0.467219
C  -2.802444 1.343784 -0.247298
C  -1.823281 2.347898 -0.418602
C  2.327615 1.305968 -0.587878
C  -0.653443 -1.815655 -0.123058
C  3.651342 0.590577 -0.631154
C  -1.479233 -4.03869 0.440431
C  4.760939 1.01397 0.02072
H  -3.135434 -0.794742 -0.002777
H  0.285014 2.807753 -0.586064
H  -3.864528 1.604157 -0.205562
H  -2.121153 3.39841 -0.51138
H  2.114032 1.803106 -1.558769
H  2.305217 2.066333 0.218256
H  3.673451 -0.310742 -1.257091
H  -0.616376 -4.247974 1.095302
H  -1.269787 -4.442942 -0.564879
H  -2.403574 -4.46622 0.854723
H  5.713961 0.48292 -0.073066
H  4.751608 1.900303 0.667601
