program: Gaussian 09
title: 000221883
version: EM64L-G09RevD.01
frameworkgroup: C1[X(C9H14O4)]
method: RPBEPBE
basis: SDD
operation: Freq
keyword: #pfreq=noraman
keyword: PBEPBE/SDD
title: #p freq=noraman PBEPBE/SDD
converged: YES YES NO NO
title: Mulliken charges:
elementType: O O O O C C C C C C C C C H H H H H H H H H H H H H H
charge: -0.276868 -0.417921 -0.213674 -0.243604 0.307171 -0.498502 -0.465374 -0.399603 -0.419745 -0.387073 0.135852 0.316733 -0.765422 0.221695 0.245487 0.252175 0.208714 0.205612 0.220025 0.253873 0.198026 0.209143 0.185570 0.381683 0.254275 0.246381 0.245374
chargesum: 0.00000
title: Mulliken charges with hydrogens summed into heavy atoms:
elementType: O O O O C C C C C C C C C
charge: -0.276868 -0.036238 -0.213674 -0.243604 0.307171 -0.031320 -0.004485 0.026033 0.032153 0.007640 0.135852 0.316733 -0.019392
polarizability: 1.24700710e+02 1.29454368e+00 9.66204489e+01 -3.11134302e+00 -3.29883302e+00 9.69432203e+01
1716.lowfreq: -4.5664 -0.0009 -0.0007 0.0004 4.3009 16.4793 44.6033 63.5103 87.6449
frequency: 44.5915 63.4598 87.6310 106.5211 111.6156 132.7971 169.0346 235.3501 262.5729 281.9461 313.4234 317.5976 359.7767 406.3089 440.9928 487.2460 520.3840 538.2074 566.9442 572.8053 655.5534 683.4225 715.1236 787.7622 813.5156 825.6208 869.3891 911.3136 916.6526 938.7804 945.3866 994.0736 1008.0324 1038.1711 1043.3833 1055.8464 1083.6509 1102.6056 1140.6749 1163.2651 1208.4982 1230.3385 1253.0778 1264.1876 1271.8245 1311.7235 1318.8483 1338.0105 1339.2673 1344.4977 1357.5808 1381.8642 1452.4507 1454.0470 1461.8149 1463.9710 1469.3823 1476.4717 1481.0321 1643.3746 1654.3826 2965.6253 2983.9383 2992.9365 2998.7746 3000.5610 3007.3111 3035.4251 3044.6624 3063.8706 3071.7947 3079.1832 3098.0146 3142.6216 3521.5151
redmass: 1.2703 5.2862 2.4762 3.3945 8.7889 5.3827 3.1510 3.5264 2.1134 4.3251 3.5549 4.8176 1.9475 4.1210 3.2330 2.3972 3.3188 2.5556 1.3448 3.2553 3.4575 4.3701 5.7138 1.4476 2.1321 3.8320 2.3812 2.3012 2.2074 1.4172 3.9551 1.9640 3.0327 2.0705 1.8336 1.9230 1.2942 1.6601 1.7100 2.1924 3.3373 2.2108 1.4389 1.3848 1.2718 1.6767 1.6462 1.3829 1.4538 1.4506 1.4663 1.2433 1.0612 1.0504 1.0840 1.0891 1.0838 1.0835 1.0948 9.5673 9.0466 1.0642 1.0623 1.0636 1.0629 1.0638 1.0372 1.0958 1.1006 1.0990 1.1013 1.1002 1.0963 1.1015 1.0642
irintensity: 1.7097 0.1413 1.2025 1.8287 2.1157 2.5556 1.2011 8.0370 1.4105 3.4026 2.4006 1.0507 1.7586 0.5017 0.5964 8.7425 23.4141 5.3034 91.1910 10.9816 24.1852 11.9445 34.7367 1.1764 2.1538 3.9599 22.0003 39.9084 6.8835 2.8020 67.9743 72.0161 122.2787 42.7570 77.0944 32.5580 3.5379 1.0408 1.8648 10.8298 284.3218 13.2290 14.9332 3.4632 3.7050 7.2158 3.5174 1.2110 11.1827 0.2734 1.7540 51.5761 26.0329 17.3762 5.9682 6.1400 14.5968 22.9888 8.8340 134.2593 206.0857 37.5660 27.5818 7.6196 35.0195 28.4240 2.5806 56.3835 46.2446 24.1093 19.7762 21.5362 7.0737 9.2457 32.0239
temp: 298.150 k
press: 1.00000 atm
elementType: 8 8 8 8 6 6 6 6 6 6 6 6 6 1 1 1 1 1 1 1 1 1 1 1 1 1 1
symmnumber: 1
zpe: 579556.7 jmol-1
zpe.correction: 0.220741 hartree
zpe.thermalcorrener: 0.234128 hartree
zpe.thermalcorrenthalpy: 0.235072 hartree
zpe.thermalcorrgfe: 0.180722 hartree
zpe.sumelectzpe: -651.252205 hartree
zpe.sumelectthermal: -651.238818 hartree
zpe.sumelectthermalent: -651.237874 hartree
zpe.sumelectthermalfe: -651.292225 hartree
dipole: 0.0718 -1.5894 2.4001
dipole: 2.8796
quadrupole: -70.8913 -72.5199 -81.8674
quadrupole: -0.0473 -2.3980 5.3712
quadrupole: 4.2016 2.5730 -6.7745 -0.0473 -2.3980 5.3712
hfenergy: -651.4729466 hartree
pointgroup: C01 [X(C9H14O4)]
dipole: -0.0795228 -0.2676342 -1.0979618 debye
polarizability: 124.2744592|0.5780418|94.5546538|-4.7198341|2.3372524|99.4352659 unknown
InChI: InChI=1S/C9H14O4/c1-7(10)13-9(8(11)12)5-3-2-4-6-9/h11H,2-6H2,1H3
charge 0 multiplicity 1
27 atoms
O  1.139092 -0.485396 -0.884017
O  0.813087 2.160358 -0.208588
O  -0.501632 1.573535 1.610071
O  2.320799 -0.095002 1.088006
C  -0.15281 -0.07269 -0.225087
C  -1.115859 0.142629 -1.422357
C  -0.640557 -1.210978 0.700628
C  -2.576472 0.345446 -0.9574
C  -2.125232 -1.059474 1.121414
C  -3.053765 -0.84792 -0.097157
C  0.039418 1.25643 0.53098
C  2.303872 -0.455626 -0.111069
C  3.495344 -0.880646 -0.937474
H  -1.050712 -0.766722 -2.05039
H  -0.758273 0.992769 -2.029278
H  0.006818 -1.266105 1.592529
H  -0.515673 -2.151721 0.128524
H  -3.222651 0.46315 -1.84762
H  -2.666335 1.281918 -0.371691
H  -2.217754 -0.204676 1.814983
H  -2.425899 -1.96712 1.678922
H  -4.092581 -0.679761 0.245125
H  -3.064379 -1.764985 -0.722828
H  0.91343 2.998983 0.317514
H  3.724488 -0.095126 -1.679803
H  3.273824 -1.806413 -1.493649
H  4.367511 -1.026858 -0.284089
