program: Gaussian 09
title: 000221878
version: EM64L-G09RevD.01
frameworkgroup: C1[X(C7H11ClO2)]
method: RPBEPBE
basis: SDD
operation: Freq
keyword: #p
keyword: freq=noraman
keyword: PBEPBE/SDD
title: #p freq=noraman PBEPBE/SDD
converged: YES YES NO NO
title: Mulliken charges:
elementType: Cl O O C C C C C C C H H H H H H H H H H H
charge: -0.016562 -0.284992 -0.212423 -0.020776 -0.450337 -0.440203 -0.436355 -0.430159 0.344673 -0.697992 0.266043 0.204899 0.241567 0.237378 0.231761 0.228795 0.220291 0.219279 0.217641 0.287542 0.289930
chargesum: 0.00000
title: Mulliken charges with hydrogens summed into heavy atoms:
elementType: Cl O O C C C C C C C
charge: -0.016562 -0.284992 -0.212423 0.245267 -0.003871 0.028936 0.012731 0.006760 0.344673 -0.120520
polarizability: 1.14014770e+02 6.06743351e+00 7.87093271e+01 -4.05803488e-01 1.63227110e+00 6.76739865e+01
1716.lowfreq: -33.8564 -0.8729 -0.0034 -0.0033 -0.0032 8.0410 13.5950 23.9451 47.2939
frequency: 6.3040 22.6064 45.3626 88.2497 118.8369 184.0348 249.7038 264.1354 375.6394 420.2737 545.0811 563.7759 633.6861 694.0453 712.0812 778.5981 801.8855 849.8135 883.2082 897.4890 905.3774 915.7807 937.1134 948.3275 1014.2327 1061.7056 1088.4415 1116.2268 1150.2190 1161.2489 1165.4992 1197.1961 1219.8739 1257.8220 1281.4379 1287.7005 1305.5712 1314.1089 1318.9474 1335.7099 1423.8037 1449.6616 1458.9629 1470.3513 1483.6667 1665.3415 2999.6480 3000.3630 3008.3719 3023.2361 3056.7574 3059.6249 3066.5494 3074.0597 3083.0920 3091.6883 3135.0423
redmass: 2.9596 2.8380 7.0422 3.3096 3.7795 2.8708 6.4640 4.0138 2.8774 3.0950 3.0959 1.9906 4.9324 2.9384 4.6704 2.2721 2.7933 2.0206 4.0083 2.7839 2.3113 1.8050 1.4878 3.5130 1.4853 1.9636 1.6754 3.2623 1.1186 1.4056 1.6356 1.4208 1.4056 1.2667 1.4001 1.3288 1.2438 1.3744 1.4810 1.4108 1.0874 1.0882 1.0792 1.0843 1.0968 10.7737 1.0616 1.0646 1.0626 1.0636 1.0956 1.0572 1.0930 1.1016 1.1009 1.1037 1.1074
irintensity: 0.7161 3.2022 1.3184 4.8174 2.9082 0.5346 6.8417 1.7236 4.1339 2.7873 3.0756 1.7263 8.4512 0.5339 11.5892 14.6861 28.0202 3.9654 10.2842 11.9099 5.1012 7.8675 28.4450 70.6083 2.0788 10.3269 14.0836 399.4429 6.1557 3.6006 1.4969 2.0416 2.3554 3.0639 26.2829 0.2846 0.3272 1.6900 0.9942 9.9468 29.6073 16.6405 6.4272 10.8680 7.4695 154.6428 34.2415 22.6782 36.4466 21.3309 28.8307 9.6106 2.8854 18.8130 12.6672 82.7774 1.9714
temp: 298.150 k
press: 1.00000 atm
elementType: 17 8 8 6 6 6 6 6 6 6 1 1 1 1 1 1 1 1 1 1 1
symmnumber: 1
zpe: 446611.3 jmol-1
zpe.correction: 0.170105 hartree
zpe.thermalcorrener: 0.180817 hartree
zpe.thermalcorrenthalpy: 0.181761 hartree
zpe.thermalcorrgfe: 0.129120 hartree
zpe.sumelectzpe: -883.059504 hartree
zpe.sumelectthermal: -883.048793 hartree
zpe.sumelectthermalent: -883.047849 hartree
zpe.sumelectthermalfe: -883.100489 hartree
dipole: -3.6932 -2.0225 -0.4128
dipole: 4.2310
quadrupole: -70.8658 -68.2629 -64.9038
quadrupole: -5.9328 -2.1960 -1.4666
quadrupole: -2.8550 -0.2520 3.1071 -5.9328 -2.1960 -1.4666
hfenergy: -883.2296096 hartree
pointgroup: C01 [X(C7H11Cl1O2)]
dipole: 1.5351384 -0.6008724 0.2305262 debye
dipolederiv: -0.4724931 0.0238951 0.0599015 0.0773183 -0.13877 -0.0190507 0.0364541 -0.0048959 -0.1378534 -1.8185186 0.0741157 0.1700963 0.0862138 -0.4599206 0.084532 0.3087068 0.0851012 -0.4080547 -0.7184701 0.0260615 0.0377554 0.2777087 -0.5934985 0.2341048 -0.1685741 0.2715058 -0.5069333 0.8273376 0.0780147 -0.1054363 0.2444343 0.3251569 -0.0031592 -0.3986869 0.0220761 0.3308131 -0.008859 0.0147612 -0.0404453 0.0632961 -0.0219176 -0.0685401 0.0214547 -0.014076 0.0782945 0.0006215 0.0053806 -0.0135452 -0.0496371 -0.0713873 -0.0614822 0.03014 -0.0947393 0.0440437 0.0936927 0.0238695 -0.0710639 0.0023783 0.0342333 -0.0147896 -0.0071141 -0.0277423 0.0649493 0.1074518 0.0354527 -0.0351564 0.002578 0.0099335 0.009554 -0.0883742 -0.010857 0.1055938 1.775644 -0.1259719 -0.1425638 -0.3135564 0.6983181 -0.4249742 -0.0585444 -0.4214827 0.5836086 0.5475904 -0.1364683 0.0035061 -0.3152949 0.0432394 0.1800654 0.1313029 0.1409741 0.0149835 -0.0717803 -0.0102338 -0.0883534 -0.0461978 0.0492023 0.0396163 0.0006571 0.0059847 -0.0771497 -0.0561001 0.0015253 0.1002711 -0.0185333 0.0848804 0.0716456 0.0733079 0.0259826 -0.0950974 0.0744039 -0.0797075 -0.0287712 -0.0626853 -0.1264529 -0.0562481 -0.0446346 -0.0180486 0.0747137 -0.0465149 0.052526 0.0724961 0.0628128 0.0567106 -0.0238665 0.0914407 -0.0628133 -0.0101599 0.0198046 -0.0080182 -0.0034845 -0.0363571 -0.0413654 0.0981261 -0.0223352 0.1292117 -0.016648 -0.1723354 0.1098696 -0.033987 0.0921341 0.025171 0.0095286 -0.0149598 -0.0047873 0.0780072 0.0521004 -0.0714997 0.1022218 -0.0444699 0.0105492 0.0502727 0.0694025 0.0632729 -0.089132 0.0503696 -0.0079037 -0.0257253 -0.0269054 0.013424 -0.0942787 -0.0752071 -0.1082269 -0.1262594 -0.1064994 -0.0718792 0.0688965 -0.0502449 0.0131839 0.0436127 0.123039 0.0803893 0.0000044 -0.0518328 0.0207322 -0.0581964 0.0280848 0.1138182 -0.0193668 -0.0293061 0.0004218 -0.0100357 -0.025613 0.0454785 0.031584 0.026923 -0.0245086 -0.0353022 0.0218308 -0.057251 0.1023118 unknown
polarizability: 114.4487151|-3.8172302|75.9355682|-3.4430585|-4.1277657|70.0137999 unknown
InChI: InChI=1S/C7H11ClO2/c8-5-7(9)10-6-3-1-2-4-6/h6H,1-5H2
charge 0 multiplicity 1
21 atoms
Cl -4.141937 -0.297855 0.897394
O  -0.204871 -0.622877 0.074344
O  -1.817665 0.83075 -0.799889
C  0.864206 0.014107 -0.790347
C  2.038144 -0.978247 -0.794822
C  1.400333 1.307436 -0.114946
C  2.824999 -0.62645 0.492185
C  2.77489 0.92669 0.526131
C  -1.493298 -0.106858 -0.047302
C  -2.389958 -0.914547 0.889321
H  0.40469 0.197497 -1.776126
H  2.661876 -0.778653 -1.688167
H  1.693915 -2.024842 -0.84432
H  0.676318 1.663765 0.63766
H  1.502576 2.114478 -0.861463
H  3.855637 -1.021605 0.487922
H  2.302284 -1.047424 1.371183
H  2.883869 1.327626 1.548729
H  3.60344 1.340806 -0.078594
H  -2.011946 -0.852768 1.920579
H  -2.413303 -1.96783 0.571629
