program: Gaussian 09
title: 000221875
version: EM64L-G09RevD.01
frameworkgroup: C1[X(C4H6BrClO2)]
method: RPBEPBE
basis: SDD
operation: Freq
keyword: #p
keyword: freq=noraman
keyword: PBEPBE/SDD
title: #p freq=noraman PBEPBE/SDD
converged: YES YES NO NO
title: Mulliken charges:
elementType: Br Cl O O C C C C H H H H H H
charge: -0.007641 -0.013261 -0.264224 -0.204125 -0.249262 -0.632614 0.368770 -0.680029 0.241989 0.277004 0.278149 0.293867 0.291598 0.299780
chargesum: 0.00000
title: Mulliken charges with hydrogens summed into heavy atoms:
elementType: Br Cl O O C C C C
charge: -0.007641 -0.013261 -0.264224 -0.204125 0.269732 -0.060599 0.368770 -0.088651
polarizability: 8.59509474e+01 -2.74356734e+00 7.02591767e+01 5.60293796e+00 -4.32083711e+00 5.43309253e+01
1716.lowfreq: -10.8596 -5.4257 -0.0026 -0.0020 0.0015 5.5966 10.5645 19.2433 48.5446
frequency: 8.7294 18.8766 48.5146 122.0844 186.1962 215.0312 285.7095 341.3671 423.8941 536.0205 537.9824 659.8515 721.5175 787.1422 874.8337 912.5396 942.3885 977.0794 1069.2590 1090.6768 1164.8615 1175.4055 1211.4188 1276.3888 1284.2727 1354.3166 1425.9543 1428.5920 1460.0732 1683.4159 3002.6167 3059.8827 3060.2971 3085.4906 3146.6360 3148.4462
redmass: 6.8490 12.1539 4.8675 4.4427 6.0040 4.3489 3.0425 5.4747 3.3270 3.3824 3.8235 6.4151 5.3798 3.3158 2.3988 1.8472 2.9745 1.6777 2.2808 2.7904 1.2479 1.3734 1.1546 1.1805 1.3673 1.3531 1.0913 1.1058 1.0794 10.5644 1.0602 1.0589 1.0589 1.1022 1.1096 1.1058
irintensity: 2.1068 0.2073 5.2189 1.1939 3.8460 1.9104 7.7055 14.7192 10.4440 9.4894 13.2017 8.1076 28.3975 0.5821 15.0882 9.6189 69.6814 19.1520 16.5367 307.1034 57.3774 6.8752 0.3286 30.4704 26.8616 5.5350 29.2370 10.7431 19.9976 160.8191 21.2242 13.7051 9.8763 4.3255 4.6026 1.3659
temp: 298.150 k
press: 1.00000 atm
elementType: 35 17 8 8 6 6 6 6 1 1 1 1 1 1
symmnumber: 1
zpe: 255568.8 jmol-1
zpe.correction: 0.097341 hartree
zpe.thermalcorrener: 0.106819 hartree
zpe.thermalcorrenthalpy: 0.107764 hartree
zpe.thermalcorrgfe: 0.057085 hartree
zpe.sumelectzpe: -779.348815 hartree
zpe.sumelectthermal: -779.339337 hartree
zpe.sumelectthermalent: -779.338393 hartree
zpe.sumelectthermalfe: -779.389072 hartree
dipole: -2.3705 2.2602 -2.5769
dipole: 4.1675
quadrupole: -72.1968 -56.6242 -66.1329
quadrupole: -6.2029 -4.1211 -0.6087
quadrupole: -7.2122 8.3604 -1.1483 -6.2029 -4.1211 -0.6087
hfenergy: -779.4461565 hartree
pointgroup: C01 [X(C4H6Br1Cl1O2)]
dipole: -1.0648925 -0.2830208 1.2142035 debye
dipolederiv: -0.1720075 0.0444924 -0.0132377 0.134628 -0.3236325 0.1296726 -0.0860066 0.1673677 -0.234068 -0.4392802 -0.0198121 0.0264285 0.0250462 -0.1341794 -0.0028364 0.0564787 -0.0013417 -0.1342154 -1.530812 -0.1563783 0.3227021 -0.3850826 -0.4037382 0.0052894 0.3759618 -0.0483589 -0.5577035 -0.5879225 -0.0909795 0.0305269 0.0285753 -0.5026265 -0.2976962 0.316234 -0.2055462 -0.7002869 0.7314577 0.0767146 0.0169207 0.3566835 0.1791089 -0.0188259 0.1507174 0.0752343 0.0981113 0.052347 -0.1017014 0.0685229 -0.1956441 0.4521186 -0.2893116 0.1330023 -0.3234156 0.362631 1.4021021 0.2810301 -0.3668549 0.4077658 0.6381294 0.3300707 -0.7308518 0.282142 0.9873736 0.5400967 -0.105675 -0.0881039 -0.289921 -0.0529128 -0.0789023 -0.1441583 -0.0858447 0.1132296 -0.0684224 0.0547069 -0.0391379 -0.0692387 -0.0421277 0.1051255 -0.0115138 0.113705 0.0402324 0.0653259 0.0084076 0.0396075 -0.0631462 0.0906562 -0.0224192 -0.0544605 -0.0763358 0.0054276 -0.0416932 -0.0553781 -0.0151566 -0.0659176 -0.0448423 0.0569503 -0.0217955 0.0625271 0.0586039 0.1094325 0.0181369 -0.0269826 0.0681128 -0.0051421 0.041576 0.0016307 0.0099338 -0.102235 -0.0179809 0.0002753 0.0554623 0.0145681 0.127146 0.0072213 0.0249082 -0.0215345 -0.0315969 -0.0426431 0.0461606 -0.0106973 0.0335703 0.0220424 0.0340857 -0.0101467 0.0514675 0.0944962 unknown
polarizability: 86.880155|-0.5844619|63.6418046|-4.3993053|-8.683991|60.0190898 unknown
InChI: InChI=1S/C4H6BrClO2/c5-1-2-8-4(7)3-6/h1-3H2
charge 0 multiplicity 1
14 atoms
Br -2.820795 1.159202 -0.933962
Cl 3.572735 0.642209 -0.145637
O  -0.222194 -0.216646 0.689571
O  1.003377 -0.819488 -1.216861
C  -1.354373 -1.087029 0.281431
C  -2.652389 -0.312987 0.444955
C  0.875186 -0.138239 -0.186447
C  1.80316 0.942881 0.348395
H  -1.351474 -1.951998 0.9724
H  -1.191787 -1.441755 -0.750862
H  -3.523577 -0.967614 0.286884
H  -2.7143 0.191381 1.420301
H  1.760506 0.984672 1.444582
H  1.514825 1.916711 -0.078148
