program: Gaussian 09
title: 000221873
version: EM64L-G09RevD.01
frameworkgroup: C1[X(C14H10ClNO3)]
method: RPBEPBE
basis: SDD
operation: Freq
keyword: #p
keyword: freq=noraman
keyword: PBEPBE/SDD
title: #p freq=noraman PBEPBE/SDD
converged: YES YES NO NO
title: Mulliken charges:
elementType: Cl O O O N C C C C C C C C C C C C C C H H H H H H H H H H
charge: -0.073584 -0.283677 -0.423547 -0.308721 -0.474932 0.105787 0.141532 0.483912 0.126070 -0.310857 -0.305337 -0.226574 -0.434633 -0.358127 -0.225929 -0.041051 -0.190564 0.152124 -0.260684 0.379484 0.293681 0.280724 0.243143 0.269965 0.314866 0.243436 0.230911 0.256182 0.396402
chargesum: 0.00000
title: Mulliken charges with hydrogens summed into heavy atoms:
elementType: Cl O O O N C C C C C C C C C C C C C C
charge: -0.073584 -0.283677 -0.027145 -0.308721 -0.095447 0.105787 0.141532 0.483912 0.126070 -0.017177 -0.024613 0.016568 -0.164668 -0.043262 0.017507 -0.041051 0.040347 0.152124 -0.004501
polarizability: 3.13102145e+02 1.32447951e+01 1.99393952e+02 5.27113920e+00 -1.77199669e+00 7.13790647e+01
1716.lowfreq: -7.0295 -1.6079 0.0005 0.0007 0.0021 3.0490 19.0197 36.5551 53.5503
frequency: 18.9677 36.5489 53.5484 65.5643 100.4794 106.0447 183.1525 188.7166 194.2289 202.4810 257.7815 277.4056 315.5396 362.4420 394.8914 403.1215 415.4421 432.7388 436.3402 461.5765 539.3393 569.6746 582.7733 605.8740 617.1459 645.5504 673.6551 676.3603 688.8014 704.2554 770.2973 779.8405 791.5147 795.3169 858.4559 860.8420 871.7354 915.0161 917.4784 945.4756 978.2564 993.4132 994.1310 1015.5764 1019.5741 1048.8766 1072.3730 1086.5346 1097.0751 1129.1046 1154.7381 1174.7963 1182.9597 1225.5941 1264.8258 1276.7751 1309.8812 1327.2669 1370.8031 1376.5766 1413.3756 1422.1135 1468.6244 1472.1376 1549.4867 1560.6686 1575.1500 1590.5243 1605.4392 1612.4280 1659.3461 3141.8041 3144.8179 3155.5576 3159.6185 3165.7735 3172.5305 3178.1274 3188.9110 3204.5114 3525.0208
redmass: 7.1987 6.3103 9.8654 9.3636 8.1995 4.5350 6.2459 9.0096 5.0540 7.4580 6.9215 4.9667 6.2795 8.5164 5.3946 7.9845 8.8827 4.1986 3.2753 4.2877 6.2089 5.0560 6.1168 1.3331 4.5681 6.2429 5.8352 4.5720 2.3422 3.2664 5.7251 4.2411 1.3625 1.5426 3.4923 4.6589 1.9647 1.3641 1.4169 1.1984 5.9502 1.3578 1.3366 1.3726 5.5197 3.3985 2.0419 2.5621 1.6820 1.8796 1.9122 1.0885 1.0701 3.3111 1.8490 1.4633 1.7878 2.7913 8.1451 6.7618 2.3475 2.7524 2.4386 2.6926 5.0204 5.7690 7.6608 5.3437 6.0054 7.1159 1.6089 1.0870 1.0889 1.0929 1.0919 1.0867 1.0958 1.0956 1.0963 1.0950 1.0642
irintensity: 0.1238 1.4187 2.8354 0.6977 0.9663 1.9716 0.8032 3.3812 0.4620 3.9070 0.5975 1.7445 11.0875 3.5743 1.6919 6.1317 12.0138 9.3535 5.1489 3.8378 2.1010 1.4584 28.9315 98.4550 54.3848 5.5168 20.4032 7.9363 33.7432 92.0417 2.9350 9.0066 72.6480 29.9145 5.2620 45.7091 13.6203 1.3682 1.2329 147.9262 11.7226 1.3038 10.1121 2.3851 191.8860 19.4939 25.4653 51.1885 36.1650 37.3985 102.4387 0.2191 4.9041 40.7311 16.3672 7.2900 20.4063 102.8621 8.5086 73.4620 9.2422 26.9348 14.4514 173.9810 200.3717 100.2775 61.0947 590.2781 21.2311 8.2196 25.7917 5.9246 19.7800 2.2861 17.1215 525.8626 25.8797 3.5433 8.6667 6.8886 67.8239
temp: 298.150 k
press: 1.00000 atm
elementType: 17 8 8 8 7 6 6 6 6 6 6 6 6 6 6 6 6 6 6 1 1 1 1 1 1 1 1 1 1
symmnumber: 1
zpe: 548975.3 jmol-1
zpe.correction: 0.209094 hartree
zpe.thermalcorrener: 0.225095 hartree
zpe.thermalcorrenthalpy: 0.226039 hartree
zpe.thermalcorrgfe: 0.163398 hartree
zpe.sumelectzpe: -1278.680727 hartree
zpe.sumelectthermal: -1278.664725 hartree
zpe.sumelectthermalent: -1278.663781 hartree
zpe.sumelectthermalfe: -1278.726423 hartree
dipole: -4.7946 1.8194 -0.2776
dipole: 5.1357
quadrupole: -100.5499 -107.2524 -120.7804
quadrupole: -10.0219 4.3393 2.9650
quadrupole: 8.9776 2.2752 -11.2528 -10.0219 4.3393 2.9650
hfenergy: -1278.8898204 hartree
pointgroup: C01 [X(C14H10Cl1N1O3)]
dipole: -1.9382517 -0.209832 0.5308002 debye
polarizability: 305.670831|-36.8391431|154.9509024|-4.7949797|-62.8589536|123.2534289 unknown
InChI: InChI=1S/C14H10ClNO3/c15-9-4-3-5-10(8-9)16-13(17)11-6-1-2-7-12(11)14(18)19/h1-8,16,18H
charge 0 multiplicity 1
29 atoms
Cl 5.125633 -1.940792 1.479706
O  -0.115721 1.626197 -1.610834
O  -2.811577 -2.470969 1.572263
O  -0.676843 -1.649437 1.536085
N  0.59298 0.11761 0.024029
C  -1.838541 0.726769 -0.167675
C  -2.525303 -0.286027 0.601426
C  1.989095 0.099049 -0.232467
C  -0.376634 0.838418 -0.642531
C  -2.622467 1.806061 -0.661475
C  -3.933191 -0.168989 0.810866
C  -4.003719 1.920957 -0.420316
C  2.762218 -0.765503 0.596218
C  2.632742 0.875539 -1.235863
C  -4.670321 0.920971 0.320383
C  4.149478 -0.828577 0.406076
C  4.031948 0.778308 -1.391516
C  -1.895886 -1.474447 1.243178
C  4.815682 -0.071314 -0.57711
H  0.261853 -0.529029 0.769707
H  -2.098177 2.547197 -1.27146
H  -4.435962 -0.956241 1.376928
H  -4.554407 2.780758 -0.816151
H  2.279116 -1.373301 1.367973
H  2.033539 1.530565 -1.868771
H  -5.746351 0.985097 0.510639
H  4.525345 1.377053 -2.164716
H  5.899389 -0.142274 -0.701739
H  -2.326617 -3.211848 2.026645
