program: Gaussian 09
title: 000221868
version: EM64L-G09RevD.01
frameworkgroup: C1[X(C14H13NO2)]
method: RPBEPBE
basis: SDD
operation: Freq
keyword: #p
keyword: freq=noraman
keyword: PBEPBE/SDD
title: #p freq=noraman PBEPBE/SDD
converged: YES YES NO NO
title: Mulliken charges:
elementType: O O N C C C C C C C C C C C C C C H H H H H H H H H H H H H
charge: -0.453939 -0.289713 -0.375049 -0.352343 0.381143 0.495225 -0.371947 -0.419221 -0.415460 -0.380944 -0.237059 -0.230387 -0.223510 -0.236228 -0.246438 -0.242460 0.220222 0.270180 0.335077 0.252839 0.252186 0.255832 0.252796 0.227742 0.229081 0.226937 0.227638 0.230104 0.230683 0.387017
chargesum: 0.00000
title: Mulliken charges with hydrogens summed into heavy atoms:
elementType: O O N C C C C C C C C C C C C C C
charge: -0.066922 -0.289713 -0.039972 -0.082163 0.381143 0.495225 -0.119109 -0.167035 -0.159629 -0.128149 -0.009318 -0.001307 0.003427 -0.008590 -0.016334 -0.011776 0.220222
polarizability: 1.89183978e+02 -5.61904852e+00 1.65814199e+02 -1.70068096e+01 -3.38480943e+00 1.13918910e+02
1716.lowfreq: -6.2514 -1.0456 -0.0008 -0.0006 0.0005 7.4460 19.1704 26.4530 43.9066
frequency: 18.7674 26.1646 43.8764 64.2108 80.6444 89.8902 200.1705 208.6229 230.2833 284.8643 314.4998 326.8431 401.5045 406.5292 448.3249 479.2480 485.4775 557.1768 575.4773 592.1486 615.1269 616.6952 624.5326 651.5794 699.4415 706.7312 708.3688 746.7048 772.3149 827.6920 857.5225 861.8178 863.7322 925.4616 935.1763 967.8378 981.3388 986.5348 990.4315 991.5181 998.8696 999.9649 1025.0088 1028.7668 1043.3602 1083.2696 1088.0973 1146.0355 1172.7386 1173.7952 1187.5381 1190.2405 1193.4091 1216.0561 1263.2846 1269.7241 1312.3401 1328.1053 1342.8846 1380.9764 1384.3833 1435.4352 1445.1317 1481.4297 1483.2329 1492.1778 1590.2757 1595.3380 1611.6688 1614.1230 1684.6745 3006.9504 3119.4007 3123.0338 3123.1938 3129.7155 3135.0160 3142.0705 3146.7799 3150.0421 3163.7413 3164.6703 3557.1568 3584.3365
redmass: 4.4081 5.8036 4.2520 6.8691 5.3248 5.0805 5.9932 4.6858 5.2046 5.7692 4.7790 5.0057 2.8095 2.8644 3.7085 1.1018 3.5717 3.7690 1.9442 3.6429 4.0508 6.3521 2.8342 5.4036 5.6720 2.2855 1.8995 1.6973 1.9413 3.7628 1.3265 2.5177 1.4252 1.5502 1.4984 4.7510 1.4462 1.5631 4.4650 4.5823 1.3238 1.3211 2.5441 2.1739 2.7250 1.6067 1.6114 1.9151 1.0510 1.0563 1.5175 1.1377 1.7165 2.2929 1.5333 1.6015 1.4294 1.3788 1.3102 7.4043 6.2033 2.2290 2.1426 2.2495 2.2584 1.9179 6.0752 6.2204 6.0082 6.0808 7.8991 1.0825 1.0860 1.0865 1.0857 1.0875 1.0916 1.0920 1.0960 1.0959 1.1015 1.1015 1.0773 1.0651
irintensity: 0.6783 1.1340 0.1604 2.7846 1.2301 1.0966 4.5939 0.4176 1.4606 0.1755 0.8655 1.1942 0.0675 0.4008 3.2290 233.5017 11.6764 57.3512 22.5731 21.4483 28.5906 0.0615 56.0907 3.7814 19.7658 63.0938 55.1131 55.1095 33.7706 23.3116 0.9395 15.9615 6.1048 10.3547 2.2115 51.7779 0.2021 0.3738 1.4549 0.7478 0.3048 0.7196 4.2497 9.8465 98.8425 15.0769 38.8204 199.2173 0.0636 0.3396 13.6507 2.0745 12.3128 10.0673 1.0725 8.0918 23.9471 18.6525 8.8351 0.9683 0.3276 9.0133 10.7806 5.3731 31.8535 289.0430 4.3044 0.4756 6.7164 6.3328 368.4411 7.1030 6.0303 0.9116 1.3967 1.2707 11.9417 17.0994 32.4982 34.9313 29.8642 17.9049 29.8867 57.9433
temp: 298.150 k
press: 1.00000 atm
elementType: 8 8 7 6 6 6 6 6 6 6 6 6 6 6 6 6 6 1 1 1 1 1 1 1 1 1 1 1 1 1
symmnumber: 1
zpe: 621901.0 jmol-1
zpe.correction: 0.236870 hartree
zpe.thermalcorrener: 0.251510 hartree
zpe.thermalcorrenthalpy: 0.252454 hartree
zpe.thermalcorrgfe: 0.192369 hartree
zpe.sumelectzpe: -745.308308 hartree
zpe.sumelectthermal: -745.293668 hartree
zpe.sumelectthermalent: -745.292723 hartree
zpe.sumelectthermalfe: -745.352809 hartree
dipole: -0.2265 -1.5150 1.7764
dipole: 2.3457
quadrupole: -88.9887 -92.2884 -101.5977
quadrupole: -1.6804 -1.6650 4.6133
quadrupole: 5.3029 2.0032 -7.3061 -1.6804 -1.6650 4.6133
hfenergy: -745.5451778 hartree
pointgroup: C01 [X(C14H13N1O2)]
dipole: 0.2079245 0.6513214 -0.6198504 debye
polarizability: 186.3591259|-5.3438019|166.7062227|20.9690717|-4.9060414|115.8517389 unknown
InChI: InChI=1S/C14H13NO2/c16-14(17)15-13(11-7-3-1-4-8-11)12-9-5-2-6-10-12/h1-10,13,15-16H
charge 0 multiplicity 1
30 atoms
O  -0.460806 -3.733687 -1.471821
O  -0.351279 -3.353511 0.84652
N  -0.355134 -1.588373 -0.712705
C  -0.170487 -0.495732 0.267297
C  -1.239123 0.598481 0.102976
C  1.282043 0.007838 0.221287
C  -1.052556 1.869916 0.705473
C  2.231647 -0.528517 1.125525
C  -2.458731 0.337393 -0.568489
C  1.714239 0.939435 -0.756832
C  -2.05853 2.857412 0.630421
C  3.589484 -0.143441 1.05573
C  -3.464366 1.327828 -0.650759
C  3.071502 1.321667 -0.832267
C  -3.268836 2.59257 -0.052271
C  4.01402 0.781805 0.074554
C  -0.380555 -2.904633 -0.329046
H  -0.326705 -0.977053 1.252573
H  -0.29369 -1.380719 -1.711043
H  -0.116994 2.086541 1.233267
H  1.905665 -1.256758 1.878206
H  -2.626105 -0.648257 -1.016094
H  0.986299 1.376247 -1.451512
H  -1.897883 3.832812 1.103451
H  4.312759 -0.563846 1.763319
H  -4.400678 1.108099 -1.176219
H  3.394142 2.041137 -1.59336
H  -4.048453 3.360069 -0.113277
H  5.066606 1.081134 0.017796
H  -0.479998 -4.675762 -1.164705
