program: Gaussian 09
title: 000221862
version: EM64L-G09RevD.01
frameworkgroup: C1[X(C18H14O3S)]
method: RPBEPBE
basis: SDD
operation: Freq
keyword: #p
keyword: freq=noraman
keyword: PBEPBE/SDD
title: #p freq=noraman PBEPBE/SDD
converged: YES YES NO NO
title: Mulliken charges:
elementType: S O O O C C C C C C C C C C C C C C C C C C H H H H H H H H H H H H H H
charge: 0.946193 -0.383569 -0.502833 -0.502829 0.362034 0.340622 0.305879 -0.041172 -0.357811 -0.359077 -0.345721 -0.343034 -0.384043 -0.382629 -0.243375 -0.244515 -0.233398 -0.233227 -0.199060 -0.198581 -0.236978 -0.214951 0.240627 0.241161 0.254955 0.253315 0.237945 0.239666 0.283306 0.284190 0.228685 0.229209 0.243444 0.243537 0.232703 0.239332
chargesum: 0.00000
title: Mulliken charges with hydrogens summed into heavy atoms:
elementType: S O O O C C C C C C C C C C C C C C C C C C
charge: 0.946193 -0.383569 -0.502833 -0.502829 0.362034 0.340622 0.305879 -0.041172 -0.117184 -0.117915 -0.090766 -0.089718 -0.146098 -0.142963 0.039931 0.039675 -0.004713 -0.004018 0.044383 0.044957 -0.004275 0.024381
polarizability: 5.81938286e+02 -2.95864652e+00 2.11421229e+02 -6.12185284e-02 -9.36359680e+00 1.31012956e+02
1716.lowfreq: -5.2466 -0.0008 -0.0001 0.0021 0.6469 6.8746 10.2134 18.6691 20.9358
frequency: 7.9910 18.5866 20.8804 37.2685 52.3278 71.4269 82.6323 107.8154 142.7105 158.4617 167.8798 179.3118 241.3554 260.7040 290.6494 332.2665 340.1928 371.8336 394.9916 402.9600 404.3962 413.7267 425.4781 454.3679 494.7736 508.2664 552.0958 578.3425 601.4903 612.0234 631.1833 656.9129 686.5858 699.0417 704.4786 733.1240 758.4039 775.7743 814.4582 821.0473 827.9929 847.8625 848.9966 860.3696 922.2368 933.6768 933.9418 965.5106 971.8610 974.7187 976.2734 983.6743 988.0687 991.7981 996.1215 1004.9507 1007.5840 1007.6233 1038.1823 1046.8434 1078.1782 1087.1023 1111.3040 1154.5077 1174.0359 1175.0219 1178.6758 1194.2891 1222.2500 1292.4918 1296.0853 1304.3000 1311.1798 1348.2889 1376.2229 1384.7443 1426.5997 1437.1338 1437.9207 1451.8112 1463.7734 1500.3119 1539.3026 1576.2403 1583.1081 1596.9006 1602.5950 1610.6574 3125.9125 3130.3903 3139.5030 3141.3216 3141.9625 3145.4942 3151.1853 3152.1842 3160.1221 3167.3798 3169.0887 3169.4220 3173.1641 3177.5940
redmass: 6.1623 4.1208 6.8252 5.1922 6.7598 3.8627 7.0339 5.6060 7.7045 6.4985 5.7003 7.6294 8.1146 7.0450 7.2885 7.0517 6.3055 8.8710 5.3015 2.8218 2.9350 3.1969 6.6913 5.6313 4.2669 3.8095 3.5762 3.8337 6.4825 6.5475 6.9372 6.9648 2.4477 1.7394 5.7838 2.9452 1.4036 2.1028 11.7358 4.4625 1.3646 1.2439 1.2716 1.7915 1.4428 1.3441 17.4196 1.3753 1.4246 1.4473 6.3837 1.3892 4.5558 5.2055 1.3216 1.3365 2.9371 4.1607 1.9193 2.1088 1.5472 1.6326 1.3620 1.6973 1.0555 1.0540 1.1225 1.1793 1.8209 3.0657 1.3168 1.2974 1.5950 2.5347 7.7524 8.5975 4.3413 2.2527 2.4114 2.0263 2.1011 2.6923 6.1215 5.8466 6.0153 5.8550 6.9091 6.0576 1.0846 1.0875 1.0860 1.0903 1.0885 1.0898 1.0887 1.0961 1.0929 1.1016 1.0959 1.0969 1.0971 1.1015
irintensity: 0.9287 0.5061 2.0147 0.1582 0.1914 2.6183 7.9526 2.6356 1.7134 23.0472 1.5589 13.3521 34.3715 27.1478 25.1577 1.0698 5.6976 13.8572 4.2629 0.0019 4.6347 0.3430 75.5561 69.3978 104.5039 1.8260 5.1134 12.4101 0.0008 0.0786 0.1203 6.8595 28.6505 47.6345 10.5729 22.4394 69.7578 51.5704 62.7819 12.0039 1.3025 0.2855 1.2465 64.2940 1.7930 1.9516 60.2583 0.8211 0.2640 1.8410 15.7285 0.0055 0.0156 10.4124 0.0309 1.1187 0.8012 3.8712 2.7471 28.3905 5.0462 8.6435 8.9322 73.4549 0.0141 0.0130 22.3062 16.8292 4.8587 19.8651 1.2386 3.1004 2.2622 0.0357 0.5010 6.1619 11.1816 17.9505 2.3772 20.9102 18.8484 1.4409 0.3164 15.6624 1.8288 192.3608 0.5096 3.6399 7.8469 0.7695 0.7776 25.3129 3.7679 0.3360 10.4129 37.0127 2.1718 43.6289 6.7230 4.5781 5.4059 41.0261
temp: 298.150 k
press: 1.00000 atm
elementType: 16 8 8 8 6 6 6 6 6 6 6 6 6 6 6 6 6 6 6 6 6 6 1 1 1 1 1 1 1 1 1 1 1 1 1 1
symmnumber: 1
zpe: 700989.3 jmol-1
zpe.correction: 0.266993 hartree
zpe.thermalcorrener: 0.286644 hartree
zpe.thermalcorrenthalpy: 0.287588 hartree
zpe.thermalcorrgfe: 0.214197 hartree
zpe.sumelectzpe: -1316.352798 hartree
zpe.sumelectthermal: -1316.333148 hartree
zpe.sumelectthermalent: -1316.332203 hartree
zpe.sumelectthermalfe: -1316.405594 hartree
dipole: -0.5402 -1.4578 -3.0063
dipole: 3.3846
quadrupole: -83.1510 -123.6250 -147.6046
quadrupole: 5.2347 11.5933 -4.9944
quadrupole: 34.9758 -5.4981 -29.4777 5.2347 11.5933 -4.9944
hfenergy: -1316.6197911 hartree
pointgroup: C01 [X(C18H14O3S1)]
dipole: 0.229751 0.563228 1.1845305 debye
polarizability: 581.8378703|-4.0936404|171.4940273|-6.2290953|-41.2120299|171.0405731 unknown
InChI: InChI=1S/C12H9O.C6H5O2S/c13-12-8-6-11(7-9-12)10-4-2-1-3-5-10;7-9(8)6-4-2-1-3-5-6/h1-9H;1-5H
charge 0 multiplicity 1
36 atoms
S  2.589425 -0.567049 -0.999402
O  1.486478 0.337335 0.48573
O  2.447078 0.27919 -2.383922
O  2.29552 -2.169436 -0.977799
C  -2.727681 0.116736 0.189996
C  -4.212005 0.056311 0.11731
C  0.120067 0.24032 0.346263
C  4.270437 -0.229317 -0.232548
C  -2.004651 1.185304 -0.42163
C  -1.985805 -0.895208 0.870512
C  -0.604551 1.248032 -0.356771
C  -0.585326 -0.846931 0.941988
C  -4.973044 -0.532986 1.167075
C  -4.913787 0.584522 -1.003782
C  4.786812 -1.183387 0.659107
C  4.930501 0.957162 -0.591157
C  -6.380408 -0.591134 1.099286
C  -6.320932 0.524312 -1.073213
C  6.057065 -0.925139 1.223626
C  6.199478 1.19436 -0.014298
C  -7.06281 -0.063262 -0.021722
C  6.756026 0.259416 0.890473
H  -2.553698 1.987585 -0.925721
H  -2.515466 -1.74633 1.311388
H  -0.047622 2.068394 -0.820339
H  -0.012396 -1.631452 1.446133
H  -4.462247 -0.916966 2.057187
H  -4.352868 1.012184 -1.842232
H  4.227149 -2.095852 0.886808
H  4.478342 1.65476 -1.302892
H  -6.945502 -1.039667 1.923861
H  -6.83859 0.926422 -1.951095
H  6.495729 -1.646851 1.920192
H  6.747891 2.106235 -0.271714
H  -8.156011 -0.109368 -0.075328
H  7.738996 0.452357 1.333426
