program: Gaussian 09
title: 000221863
version: EM64L-G09RevD.01
frameworkgroup: C1[X(C18H18N2O5)]
method: RPBEPBE
basis: SDD
operation: Freq
keyword: #p
keyword: freq=noraman
keyword: PBEPBE/SDD
title: #p freq=noraman PBEPBE/SDD
converged: YES YES NO NO
title: Mulliken charges:
elementType: O O O O O N N C C C C C C C C C C C C C C C C C C H H H H H H H H H H H H H H H H H H
charge: -0.257515 -0.183637 -0.172630 -0.203825 -0.198437 0.010680 0.020562 -0.198358 -0.440002 -0.435771 -0.405417 -0.400418 -0.387157 0.421071 0.052220 -0.390016 -0.346010 -0.254044 -0.227334 0.251399 0.281305 -0.273669 -0.480956 -0.384388 0.426853 0.260483 0.221047 0.181520 0.199704 0.205766 0.208410 0.202885 0.203212 0.202205 0.188050 0.205028 0.241730 0.266287 0.232680 0.239247 0.293426 0.329288 0.294529
chargesum: 0.00000
title: Mulliken charges with hydrogens summed into heavy atoms:
elementType: O O O O O N N C C C C C C C C C C C C C C C C C C
charge: -0.257515 -0.183637 -0.172630 -0.203825 -0.198437 0.010680 0.020562 0.062124 -0.037435 -0.030301 0.005878 0.004999 0.005921 0.421071 0.052220 -0.148286 -0.079723 -0.021364 0.011913 0.251399 0.281305 0.019757 -0.151668 -0.089859 0.426853
polarizability: 3.01069086e+02 2.24894672e+01 2.28356064e+02 1.18230613e+01 -1.76355259e+01 1.86003959e+02
1716.lowfreq: -0.0064 -0.0006 0.0004 4.5809 7.4818 8.0526 11.0270 21.9497 37.5593
frequency: 7.4911 21.6490 36.4523 45.8592 55.6158 56.9842 77.8577 88.9775 99.6075 141.6040 148.7434 170.5148 191.6818 206.7483 224.8261 253.0485 282.0745 307.8793 312.6953 336.6836 355.0326 365.0583 407.1513 425.1298 428.5408 473.1966 481.1790 494.9504 496.6951 514.2105 541.4842 557.3514 613.9248 614.6855 633.8012 648.0244 676.9439 710.5583 727.0237 743.5370 747.3281 756.7663 766.4281 777.1952 784.6736 817.7876 839.7924 847.7730 859.1283 868.9745 886.7261 894.1783 898.8833 920.7449 949.7912 952.7235 988.8286 990.1101 993.5400 1037.1692 1049.5328 1053.4182 1055.1218 1068.5527 1074.5671 1112.8307 1113.1145 1134.3042 1144.0871 1155.1539 1170.6762 1181.5424 1204.6566 1208.3823 1220.1679 1235.2028 1244.2284 1255.9025 1260.0134 1260.8601 1278.7125 1306.8256 1312.5794 1333.6518 1335.6123 1342.7649 1347.5878 1356.2554 1359.2452 1373.7427 1388.8298 1401.1315 1430.9660 1436.4389 1458.1789 1460.2415 1462.7035 1465.7043 1468.9595 1471.9503 1477.0556 1581.0468 1585.6617 1605.7823 1612.8920 2961.4079 2964.9540 2966.7090 2970.4316 2973.6719 2997.8383 3021.8166 3030.2851 3033.3151 3036.9937 3047.2326 3134.0941 3145.1938 3155.5563 3169.8844 3171.9291 3187.5633 3189.2303
redmass: 6.3412 6.3193 3.1246 8.0973 9.0352 10.5929 5.2962 4.2284 4.1917 10.1077 6.2272 6.3254 4.0452 4.1662 1.8295 4.7386 6.8505 5.6580 5.5553 2.1332 7.6586 6.0668 3.4827 3.9604 3.1773 2.9438 2.5547 3.8992 3.1787 5.6808 3.8883 5.6276 7.2222 4.6247 6.1725 7.6387 7.9507 6.7199 5.5048 4.6064 3.3200 6.1679 2.4175 1.8213 1.4592 4.3795 4.4381 1.4419 1.6403 1.4261 4.6353 1.9094 2.1469 1.9374 1.4652 1.4016 1.3385 2.4210 1.3356 2.1309 1.8179 2.1825 1.5758 1.6201 1.6482 3.9481 2.5549 2.5613 1.3131 1.8140 1.1415 1.4535 2.5614 5.0467 7.4303 1.4792 2.9374 1.7740 1.2683 1.3332 1.5812 1.2871 1.3506 1.3052 1.3672 1.5006 1.4669 1.7742 6.5285 11.6093 3.2061 9.0898 6.1414 2.2227 1.0938 1.1312 1.0909 2.3509 1.1765 1.8893 1.2343 6.5065 8.3272 7.2892 7.1112 1.0597 1.0638 1.0626 1.0637 1.0624 1.0834 1.0979 1.0959 1.1000 1.1015 1.1031 1.0855 1.0893 1.0949 1.0892 1.1006 1.0936 1.0956
irintensity: 0.0231 1.2189 0.0763 0.3710 0.4437 0.2584 1.7252 0.5633 1.8691 3.0130 1.3259 1.1263 1.5683 2.1024 0.1263 0.1879 0.0843 1.8966 0.1717 0.3999 0.1350 0.2191 2.6068 0.5586 0.8005 7.7175 2.5140 1.6744 4.5406 2.1886 0.9977 1.1571 3.5595 2.5125 10.0273 8.2023 19.8907 11.9524 16.6902 12.2313 13.1201 21.4293 5.6371 50.9520 0.2369 7.8534 8.5758 31.1377 6.9760 0.9716 23.6920 20.6946 1.7258 0.1043 24.5428 1.2959 0.2731 25.2504 0.6088 12.2707 0.4181 16.7786 11.7033 36.7397 37.2053 7.2503 1.6581 42.7330 38.5793 85.7232 1.5325 0.5862 133.0907 268.9601 269.1007 19.0089 256.9530 8.4624 1.4847 1.0202 1.6649 5.2382 8.7354 0.2607 0.4503 0.5189 2.3756 17.3841 94.9095 88.4384 3.3144 57.3792 23.4287 23.8212 2.3990 11.3032 6.4794 148.1657 40.7458 30.5468 10.2939 27.3738 20.8288 131.2688 74.0229 26.3644 30.1715 43.9119 16.6823 25.6732 12.5448 64.7450 67.7731 28.4119 7.3367 108.2879 2.0878 6.8251 20.6160 0.7667 16.4666 11.1526 8.5508
temp: 298.150 k
press: 1.00000 atm
elementType: 8 8 8 8 8 7 7 6 6 6 6 6 6 6 6 6 6 6 6 6 6 6 6 6 6 1 1 1 1 1 1 1 1 1 1 1 1 1 1 1 1 1 1
symmnumber: 1
zpe: 870695.7 jmol-1
zpe.correction: 0.331630 hartree
zpe.thermalcorrener: 0.353509 hartree
zpe.thermalcorrenthalpy: 0.354453 hartree
zpe.thermalcorrgfe: 0.277137 hartree
zpe.sumelectzpe: -1180.350946 hartree
zpe.sumelectthermal: -1180.329068 hartree
zpe.sumelectthermalent: -1180.328123 hartree
zpe.sumelectthermalfe: -1180.405440 hartree
dipole: 6.0553 3.7644 -2.4130
dipole: 7.5273
quadrupole: -168.1134 -135.6438 -159.7087
quadrupole: -1.2389 -9.5009 7.0314
quadrupole: -13.6248 18.8449 -5.2201 -1.2389 -9.5009 7.0314
hfenergy: -1180.6825768 hartree
pointgroup: C01 [X(C18H18N2O5)]
dipole: 2.2205095 -0.5467636 1.8816483 debye
polarizability: 287.085898|-42.1951283|196.5608329|11.5222405|-18.6517866|231.7823784 unknown
InChI: InChI=1S/C18H18N2O5/c21-19(22)14-10-11-18(16(12-14)20(23)24)25-17-9-5-4-8-15(17)13-6-2-1-3-7-13/h4-5,8-13H,1-3,6-7H2
charge 0 multiplicity 1
43 atoms
O  0.182118 -1.248958 -0.203608
O  -2.338538 -0.860615 -3.266784
O  -0.116978 -0.544707 -2.842892
O  -4.624012 2.554798 1.606389
O  -5.086024 2.308396 -0.617217
N  -1.35663 -0.537561 -2.493539
N  -4.364086 2.087165 0.43003
C  2.700905 0.175702 -0.245414
C  4.088957 -0.069465 -0.901497
C  2.628531 1.627587 0.321655
C  4.367444 0.971644 -2.011655
C  2.915833 2.673243 -0.78185
C  4.279868 2.416449 -1.465151
C  2.367253 -0.853894 0.829659
C  1.11554 -1.515574 0.865811
C  3.282733 -1.200858 1.859686
C  0.774022 -2.491398 1.822076
C  2.964752 -2.159486 2.845981
C  1.710913 -2.814904 2.827252
C  -0.871446 -0.379217 -0.004414
C  -1.698379 -0.070239 -1.127941
C  -1.206679 0.179137 1.258611
C  -2.854587 0.713747 -0.990353
C  -2.339829 0.992426 1.40128
C  -3.15979 1.244088 0.276709
H  1.942303 0.091755 -1.048015
H  4.12853 -1.094487 -1.316854
H  4.888396 0.001121 -0.135248
H  3.371412 1.73471 1.139504
H  1.631541 1.808776 0.770234
H  3.625298 0.841834 -2.825592
H  5.365169 0.789347 -2.455413
H  2.887868 3.692514 -0.350165
H  2.111893 2.624824 -1.54488
H  5.094556 2.579921 -0.729047
H  4.437652 3.144624 -2.283798
H  4.264596 -0.715761 1.879839
H  -0.197676 -2.992709 1.766392
H  3.69675 -2.404448 3.622977
H  1.466491 -3.572529 3.578727
H  -0.575722 -0.043041 2.122926
H  -3.497355 0.916634 -1.850914
H  -2.608497 1.430308 2.366101
