program: Gaussian 09
title: 000221865
version: EM64L-G09RevD.01
frameworkgroup: C1[X(C20H17N3O4)]
method: RPBEPBE
basis: SDD
operation: Freq
keyword: #p
keyword: freq=noraman
keyword: PBEPBE/SDD
title: #p freq=noraman PBEPBE/SDD
converged: YES YES NO NO
title: Mulliken charges:
elementType: O O O O N N N C C C C C C C C C C C C C C C C C C C C H H H H H H H H H H H H H H H H H
charge: -0.199967 -0.231959 -0.217729 -0.208579 -0.140868 0.002345 0.016529 -0.567957 -0.609616 0.394285 0.468103 0.494018 0.297820 -0.308180 -0.521846 -0.444340 -0.349453 -0.373017 -0.425614 -0.443016 0.431115 -0.239486 -0.232149 -0.221323 -0.212439 -0.234835 -0.239761 0.240705 0.292556 0.257970 0.260782 0.262009 0.331899 0.291711 0.238764 0.242860 0.259506 0.236518 0.227805 0.236054 0.234712 0.234244 0.232933 0.236891
chargesum: 0.00000
title: Mulliken charges with hydrogens summed into heavy atoms:
elementType: O O O O N N N C C C C C C C C C C C C C C C C C C C C
charge: -0.199967 -0.231959 -0.217729 -0.208579 -0.140868 0.002345 0.016529 -0.034696 -0.090864 0.394285 0.468103 0.494018 0.297820 -0.046171 -0.189947 -0.152629 -0.110689 -0.130156 -0.166108 -0.206498 0.431115 -0.011681 0.003905 0.013390 0.021806 -0.001902 -0.002870
polarizability: 3.42761792e+02 2.41385581e+00 2.48789893e+02 2.32229969e+01 -3.11461731e+01 2.14693769e+02
1716.lowfreq: -9.9591 -5.2519 -0.0005 -0.0004 0.0002 1.7911 19.6876 25.2368 29.1678
frequency: 19.5776 25.1761 29.0736 31.7831 58.7080 63.6317 70.2924 90.8866 101.6850 115.2295 144.1640 159.9751 180.9210 187.0645 203.7793 225.2232 269.8275 300.1543 333.3820 341.4920 353.1169 364.4243 402.5055 405.9418 414.6258 434.3439 460.6348 470.3841 480.4150 509.8554 526.3469 569.0260 595.0831 612.8820 615.4100 618.8092 633.2885 644.6609 673.2934 701.2231 705.8982 707.1508 719.1853 739.4681 750.5879 754.5240 762.6244 797.4229 819.2036 826.0534 856.8184 859.5933 877.2618 909.6006 920.3548 943.6063 960.4354 961.6464 979.8494 983.1090 985.7473 990.3660 993.3347 1001.7268 1002.5806 1019.8077 1027.6805 1029.5084 1057.5233 1082.3072 1091.1172 1098.6542 1121.6920 1158.9711 1174.1764 1175.5999 1189.7427 1190.1927 1192.4115 1207.0298 1209.4476 1218.5924 1222.4342 1255.9972 1264.8500 1308.8327 1316.6748 1338.8238 1342.2604 1350.8262 1355.4535 1381.5254 1384.5795 1386.2836 1403.9349 1440.6081 1442.2898 1445.8124 1464.8759 1479.5064 1485.6085 1490.4715 1509.6967 1566.0652 1594.2972 1594.6881 1611.6756 1613.7228 1615.7972 2974.5948 2986.1503 3028.0286 3055.2838 3118.4486 3124.7547 3125.9021 3127.4865 3139.1162 3140.4505 3149.9837 3151.4560 3159.3095 3167.4403 3167.7244 3185.3575 3187.8856
redmass: 6.3794 5.1013 7.0237 4.5894 10.4376 4.2609 6.1763 5.5408 9.9423 6.8358 8.3015 5.3691 5.5238 5.9358 6.3497 5.4812 6.8362 6.4148 6.8481 5.0735 4.1150 3.1898 2.8211 2.8318 2.5429 4.2559 3.0129 3.9110 5.1670 6.1316 4.5809 4.7037 5.4486 5.3861 6.1875 5.9861 6.8709 5.9261 8.0393 2.3660 5.1559 2.6360 2.4751 3.2839 2.3351 5.0825 2.1885 3.6014 3.6731 1.5395 1.2511 1.2478 6.7698 1.5028 1.4110 2.4931 1.7760 1.4711 1.4007 1.5224 1.4616 4.4133 3.6159 1.3977 1.3361 2.8273 2.2030 2.2520 2.0720 1.8998 1.5884 2.5927 4.5827 1.4138 1.0561 1.0565 1.1133 4.6543 1.2080 2.8753 3.5603 2.5395 1.5481 1.5344 1.4603 1.4653 1.4388 1.3775 7.5791 1.5172 5.1551 6.2155 5.5262 5.8147 2.0421 2.5966 2.2453 2.8486 1.2711 1.6744 2.1816 1.3409 2.8959 8.9976 6.0042 6.0386 6.7806 6.0197 6.0938 1.0593 1.0663 1.1009 1.0952 1.0883 1.0860 1.0863 1.0876 1.0907 1.0913 1.0958 1.0961 1.0884 1.1014 1.1014 1.0954 1.0926
irintensity: 0.6804 0.3780 0.2094 0.5607 0.0343 0.2104 0.4821 1.1588 1.0702 2.9345 3.4816 1.8056 3.8574 0.8181 0.8447 2.4965 1.3422 1.0558 1.9691 0.7392 1.8799 2.1373 0.0336 0.8952 2.3045 10.4334 8.4579 5.7088 1.6291 1.1161 5.6387 11.6943 2.7495 1.7686 1.2716 1.3784 7.5594 30.4982 22.5284 17.7362 39.0700 30.1269 20.9033 15.4302 42.7172 10.3527 39.7788 3.2881 2.9410 31.3209 2.2328 1.0450 2.8493 18.2218 4.5544 41.6415 19.4216 12.2752 1.6532 0.9758 1.8347 0.7470 0.8641 1.0114 0.5713 2.5330 4.8592 12.6720 20.9488 22.9688 5.8265 15.0103 10.3903 55.4153 1.0837 0.2510 3.6259 315.7332 79.4498 21.6040 451.5292 103.6169 0.9668 38.6460 38.5695 7.3114 46.4960 27.8536 116.9406 27.8801 43.2400 31.7636 4.3839 2.6286 8.5627 24.7852 8.1195 2.5812 11.9884 29.7508 8.7686 17.3702 88.3833 47.6893 0.0818 1.2084 230.5735 3.0500 27.7740 12.5609 31.8967 8.2562 5.9518 6.4941 2.8434 7.5915 0.4447 10.4571 10.0480 30.7161 25.4763 3.0121 20.5912 21.3920 2.7226 19.8958
temp: 298.150 k
press: 1.00000 atm
elementType: 8 8 8 8 7 7 7 6 6 6 6 6 6 6 6 6 6 6 6 6 6 6 6 6 6 6 6 1 1 1 1 1 1 1 1 1 1 1 1 1 1 1 1 1
symmnumber: 1
zpe: 874158.4 jmol-1
zpe.correction: 0.332949 hartree
zpe.thermalcorrener: 0.355640 hartree
zpe.thermalcorrenthalpy: 0.356584 hartree
zpe.thermalcorrgfe: 0.278188 hartree
zpe.sumelectzpe: -1235.400463 hartree
zpe.sumelectthermal: -1235.377772 hartree
zpe.sumelectthermalent: -1235.376828 hartree
zpe.sumelectthermalfe: -1235.455225 hartree
dipole: -9.3079 -0.1086 0.3145
dipole: 9.3138
quadrupole: -173.1720 -162.0578 -152.2629
quadrupole: 15.0820 -0.6352 9.7321
quadrupole: -10.6745 0.4398 10.2347 15.0820 -0.6352 9.7321
hfenergy: -1235.7334127 hartree
pointgroup: C01 [X(C20H17N3O4)]
dipole: 3.5044867 -1.0704371 0.0098611 debye
polarizability: 323.7874746|-43.6964923|239.2043563|33.2079233|25.0222988|243.2536224 unknown
InChI: InChI=1S/C20H17N3O4/c24-22(25)18-11-12-19(20(13-18)23(26)27)21(14-16-7-3-1-4-8-16)15-17-9-5-2-6-10-17/h1-13H,14-15H2
charge 0 multiplicity 1
44 atoms
O  -2.506574 2.248945 1.973098
O  -1.069796 0.796663 2.98369
O  -4.583408 -1.445028 -2.673045
O  -5.231719 0.45158 -1.572706
N  0.5958 -0.540974 0.971105
N  -1.754461 1.198476 1.953351
N  -4.396611 -0.510482 -1.794681
C  1.269908 0.682492 1.488263
C  1.378666 -1.791666 1.162065
C  -0.690359 -0.585626 0.45096
C  1.045511 1.942204 0.657812
C  2.607084 -1.942834 0.264749
C  -1.745237 0.359361 0.744312
C  -1.016594 -1.59496 -0.525332
C  -2.932607 0.411084 -0.016405
C  -2.212093 -1.587923 -1.239352
C  1.335391 1.957261 -0.73136
C  2.551665 -1.668039 -1.126144
C  0.622014 3.139961 1.282711
C  3.82215 -2.414883 0.820481
C  -3.15475 -0.551221 -1.00904
C  1.192734 3.143486 -1.480762
C  3.68544 -1.871344 -1.943175
C  0.483543 4.331046 0.535057
C  4.957277 -2.62151 0.004215
C  0.76582 4.33603 -0.849073
C  4.891505 -2.35113 -1.381417
H  2.348261 0.433567 1.478042
H  0.969319 0.861587 2.538529
H  0.697479 -2.650546 1.036106
H  1.70225 -1.816619 2.221641
H  -0.272418 -2.357533 -0.769795
H  -3.689674 1.166163 0.209893
H  -2.425566 -2.341248 -2.001961
H  1.682121 1.040704 -1.221672
H  1.624151 -1.29284 -1.573903
H  0.383442 3.139648 2.353149
H  3.881173 -2.623841 1.896207
H  1.418332 3.142634 -2.553065
H  3.629015 -1.655886 -3.015939
H  0.143859 5.246347 1.031201
H  5.889884 -2.986428 0.448178
H  0.651802 5.256913 -1.431499
H  5.770769 -2.507593 -2.01559
