program: Gaussian 09
title: 000019165
version: EM64L-G09RevD.01
frameworkgroup: C1[X(C13H12O)]
method: RPBEPBE
basis: SDD
operation: Freq
keyword: #pfreq=noraman
keyword: PBEPBE/SDD
title: #p freq=noraman PBEPBE/SDD
converged: YES YES NO NO
title: Mulliken charges:
elementType: O C C C C C C C C C C C C C H H H H H H H H H H H H
charge: -0.313787 0.478197 0.354114 -0.518833 -0.430123 -0.404933 0.345870 -0.184345 -0.808051 -0.358081 -0.386754 -0.207369 -0.194305 -0.253280 0.268229 0.232770 0.257917 0.227138 0.229063 0.235140 0.224973 0.265109 0.256575 0.226853 0.228824 0.229089
chargesum: 0.00000
title: Mulliken charges with hydrogens summed into heavy atoms:
elementType: O C C C C C C C C C C C C C
charge: -0.313787 0.478197 0.354114 -0.250604 -0.197353 -0.147016 0.345870 0.042793 -0.118875 -0.092971 -0.130179 0.019484 0.034519 -0.024191
polarizability: 2.04067223e+02 -8.52239002e+00 1.31079025e+02 1.41349114e+01 6.02479177e+00 8.97097697e+01
1716.lowfreq: -3.7495 -0.0007 -0.0004 0.0004 6.1476 9.9874 21.9765 32.8726 46.4334
frequency: 21.1309 32.6019 46.4256 76.3699 198.1703 208.7950 222.2905 288.9594 307.3642 390.4012 411.6852 439.6569 481.4596 513.9355 534.3162 563.4539 604.8818 619.7052 689.9925 693.1875 709.0590 760.4840 788.5972 808.7312 833.6786 881.0317 898.2083 909.4556 924.0927 967.1561 975.1124 985.3875 986.2412 987.1891 1001.5213 1019.5081 1047.4742 1077.3960 1086.5287 1137.0856 1166.7242 1171.3089 1172.3891 1200.8929 1250.9387 1296.3080 1308.9896 1378.9402 1386.7326 1397.1675 1422.8276 1442.2924 1470.5464 1473.0252 1474.6378 1482.6289 1593.7467 1594.4731 1611.0197 1612.8021 2976.7077 3058.0767 3087.2604 3127.6384 3130.0966 3139.7240 3143.4074 3149.4512 3156.6309 3165.6084 3173.2705 3174.7203
redmass: 1.1002 3.5256 3.7854 4.3023 4.0507 3.3761 4.2174 4.5252 4.8504 3.5581 2.9260 2.8849 3.2986 5.0665 4.0150 7.6843 5.3874 6.0723 2.2935 2.6839 3.5655 1.6164 1.5679 4.5364 1.2637 1.3026 1.4190 1.4380 2.9780 1.3617 1.3299 1.3451 5.3616 5.9683 1.5758 2.0743 1.5556 1.5012 1.4993 1.8757 1.1513 1.1103 1.1583 2.6096 4.1495 1.3284 1.3230 7.4423 8.7970 1.2313 2.4995 2.3148 2.2829 1.1343 1.2088 2.0173 6.4831 6.1457 6.4516 6.6152 1.0385 1.0954 1.0997 1.0872 1.0849 1.0892 1.0917 1.0935 1.0930 1.0961 1.0975 1.1002
irintensity: 1.3017 1.3194 0.1611 0.3603 1.6483 2.4345 0.5728 0.9712 1.4868 4.0990 0.7759 7.9559 15.6766 1.0461 4.0567 0.3579 1.5674 0.5281 38.4344 12.6729 3.5394 93.5265 43.1455 22.3770 0.9114 4.0102 7.7212 4.4597 47.7939 0.1546 0.5394 0.5326 0.6548 0.2648 9.4098 13.8306 14.7353 12.5446 9.7073 11.1960 37.5329 21.8654 20.8538 190.8811 201.6429 1.6025 0.2193 3.5369 1.2303 13.0738 27.3642 3.5828 174.3267 16.7427 19.9246 48.1336 8.1494 170.6372 39.8009 5.8689 30.4482 21.9281 19.6581 7.4723 1.8187 11.7836 16.4260 19.5537 28.0492 14.2480 9.0628 6.5226
temp: 298.150 k
press: 1.00000 atm
elementType: 8 6 6 6 6 6 6 6 6 6 6 6 6 6 1 1 1 1 1 1 1 1 1 1 1 1
symmnumber: 1
zpe: 547409.4 jmol-1
zpe.correction: 0.208497 hartree
zpe.thermalcorrener: 0.220662 hartree
zpe.thermalcorrenthalpy: 0.221606 hartree
zpe.thermalcorrgfe: 0.167801 hartree
zpe.sumelectzpe: -576.815988 hartree
zpe.sumelectthermal: -576.803823 hartree
zpe.sumelectthermalent: -576.802879 hartree
zpe.sumelectthermalfe: -576.856684 hartree
dipole: 0.3649 1.6096 0.3021
dipole: 1.6779
quadrupole: -70.4932 -78.3448 -82.8344
quadrupole: -0.8958 3.0046 1.0071
quadrupole: 6.7310 -1.1207 -5.6103 -0.8958 3.0046 1.0071
hfenergy: -577.0244852 hartree
pointgroup: C01 [X(C13H12O1)]
dipole: -0.1261379 -0.6147089 0.2049391 debye
dipolederiv: -2.3087331 0.1074487 -0.0277642 0.3421911 -0.3849912 0.0660044 0.3126962 0.0465526 -0.2377195 0.171181 0.011198 -0.0326608 0.1556441 0.4179285 0.0346101 -0.0499875 -0.0178988 -0.013039 1.7040541 0.1099033 -0.06077 0.4103134 0.2144959 0.0463758 -0.4818266 0.0443384 0.0957024 -0.3488722 -0.0915376 -0.0286708 -0.3499854 -0.2106588 0.0162483 0.0130528 0.0238974 -0.1674881 -0.0571941 0.0999366 -0.0403004 -0.0360934 -0.2770496 -0.0212187 -0.0324393 -0.0308244 -0.1982835 -0.4619651 -0.0296368 -0.0205338 0.1216869 -0.0096898 -0.0011103 0.0211266 0.0181136 -0.1833378 1.5569547 -0.2789314 0.1173073 -0.8885563 0.2059748 -0.0882908 0.1471058 -0.0586929 0.1682426 0.1721154 0.0165127 -0.0423357 0.0056812 0.1332865 0.0450272 -0.0675598 0.0393331 -0.1150206 0.0607235 -0.0000572 0.0011342 -0.0524069 -0.152211 -0.0127952 0.021721 0.0635161 0.0721506 -0.259207 -0.0004408 -0.0330417 0.2595568 -0.1788389 -0.017699 -0.269891 0.0163388 -0.1184186 -0.4412525 0.0478096 -0.0678111 -0.0159852 -0.0789565 -0.0910703 0.06387 -0.126106 -0.0345283 0.1186545 -0.0320693 -0.0686706 -0.0972169 -0.0277002 -0.120619 -0.0051566 -0.1312469 0.0597799 0.1350377 -0.0525415 -0.0424536 -0.0470401 -0.0548058 -0.1144664 -0.0822232 -0.0940937 0.0351179 -0.0793061 -0.0916362 0.0397097 -0.0491145 -0.133817 -0.0293378 0.027417 -0.030392 -0.1773918 0.0425937 0.0682365 0.0425984 0.1110046 0.0233787 -0.0303208 0.0798033 -0.0279438 0.1260742 -0.1076663 -0.0600612 0.0404706 -0.0863854 0.0632094 -0.0021243 0.0435069 -0.0029327 0.1528014 0.1050343 -0.0592525 0.0134399 -0.0513794 -0.0422144 -0.0245047 0.0128319 -0.022428 0.1646934 -0.0354702 0.1037464 0.0444595 0.1015302 -0.0148125 -0.0435474 0.053643 -0.0433044 0.1378181 0.0320953 0.0583837 0.1137213 0.0069956 0.0167774 -0.0562517 0.0614265 -0.1150889 -0.0235725 0.093994 0.012624 -0.0572759 -0.0180742 -0.0432456 0.0677203 -0.0307146 0.1164145 -0.0566041 -0.1536315 -0.0787982 -0.0520351 0.0067873 0.0642019 -0.006052 -0.0351935 -0.0279143 0.1000791 0.0143213 0.0001642 0.0907472 0.0001492 0.1131133 0.0371378 0.1361786 0.0301175 0.0730984 0.1206199 0.0384015 -0.0135889 0.0300146 0.0817725 0.1065127 -0.0062108 0.1025808 0.0241186 0.0705202 0.0185132 0.0009667 0.038204 0.0577281 0.1294371 -0.0288041 0.125215 -0.0265702 -0.0611139 -0.0142064 0.1076 -0.0084299 0.122672 0.0524712 0.1196743 0.0487942 0.036255 -0.0834875 0.0962907 -0.0242421 0.1109087 0.0944523 0.0578635 -0.024047 0.0536548 0.1060425 unknown
polarizability: 204.613563|-8.2070752|128.1158593|-12.4317889|-11.8095479|92.1265949 unknown
InChI: InChI=1S/C13H12O/c1-11-6-5-9-13(10-11)14-12-7-3-2-4-8-12/h2-10H,1H3
charge 0 multiplicity 1
26 atoms
O  0.342788 1.235877 -0.476637
C  -2.615349 -1.075897 -0.134413
C  -0.951186 0.722881 -0.194474
C  -1.281268 -0.643065 -0.342214
C  -3.601655 -0.115108 0.207834
C  -1.931116 1.681219 0.142483
C  1.513287 0.498651 -0.167628
C  -3.259903 1.250604 0.340899
C  -2.970848 -2.547466 -0.266908
C  1.620628 -0.341103 0.966331
C  2.623575 0.729126 -1.010153
C  2.858609 -0.963342 1.24247
C  3.855073 0.103668 -0.718263
C  3.978327 -0.747919 0.405153
H  -0.509725 -1.365318 -0.630858
H  -4.637656 -0.437387 0.363715
H  -1.64192 2.732018 0.234527
H  -4.031728 1.98392 0.599278
H  -2.405402 -3.029529 -1.084084
H  -2.735317 -3.098849 0.664063
H  -4.047222 -2.685339 -0.468519
H  0.760652 -0.494124 1.625491
H  2.505557 1.392878 -1.871841
H  2.947809 -1.611067 2.121793
H  4.717403 0.280938 -1.370356
H  4.934584 -1.232768 0.628011
